{"text_format":"1","workbook":"xlsx","n_sheets":2,"sheets":["Feuil1","MATCH"],"not_rendered":{"charts":0,"images":1,"macros":1,"external_links":0,"defined_names":2,"comments":0,"pivot_tables":0},"unopened":[],"bounds":{"document_bytes":16777216,"sheet_cells":100000,"rows_first":2000,"rows_last":500,"rows_between":2000,"halvings":0,"cell_chars":16384,"cell_head_chars":4096},"cells_cut":0,"cells_raw":0,"read":"whole","date_system":"1900"}

{"sheet":"Feuil1","index":0,"n_rows":29,"n_cols":62,"rows_kept":29,"cut":false,"hidden":true,"merged":[]}
[null,null,"FC1 44","FC1 48","FC1 53","FC1 58","FC1 63","FC1 69","FC1 +69","FC2 44","FC2 48","FC2 53","FC2 58","FC2 63","FC2 69","FC2 +69","FJ48","FJ53","FJ58","FJ63","FJ69","FJ75","FJ+75","FS48","FS53","FS58","FS63","FS69","FS75","FS+75","C1 50","C1 56","C1 62","C1 69","C1 77","C1 85","C1 94","C1 +94","C2 50","C2 56","C2 62","C2 69","C2 77","C2 85","C2 94","C2 +94","J56","J62","J69","J77","J85","J94","J105","J+105","S56","S62","S69","S77","S85","S94","S105","S+105"]
[null,"DEBUTANT",25,25,35,40,45,50,60,30,35,45,40,55,60,70,45,55,60,65,70,80,90,55,65,70,75,80,95,100,40,50,75,85,90,100,110,120,45,65,85,95,110,120,125,135,80,90,110,130,145,150,155,165,95,120,130,150,165,170,175,185]
[null,"DEPARTEMENTAL",35,35,45,50,55,60,70,40,45,55,50,65,70,80,55,65,70,75,80,95,100,65,75,80,85,90,105,110,55,70,95,105,110,120,130,140,65,85,105,115,130,140,145,155,100,120,130,150,165,170,175,185,115,135,150,170,185,190,195,205]
[null,"REGIONAL",40,45,55,60,65,70,80,50,55,65,60,75,80,95,65,75,80,85,90,105,110,75,85,90,95,105,115,125,65,85,105,115,130,140,145,155,80,100,120,130,150,160,165,175,115,135,150,170,185,190,195,205,130,150,170,190,205,215,220,225]
[null,"INTERREGIONAL",50,55,65,70,75,80,95,60,65,75,70,85,90,105,75,85,90,95,105,115,125,85,95,100,110,120,130,140,80,100,120,130,150,160,165,175,95,115,135,150,170,180,185,195,130,150,170,190,205,215,220,225,145,170,190,210,225,235,245,250]
[null,"FEDERAL",60,65,75,80,85,90,105,70,75,85,80,95,105,115,85,95,100,110,120,130,140,95,105,115,125,135,145,150,95,115,135,150,170,180,185,195,110,130,150,170,185,200,210,220,145,170,190,210,225,235,245,250,170,190,220,240,250,260,270,280]
[null,"NATIONAL",70,75,85,90,95,105,115,80,85,95,90,110,120,130,95,105,115,125,135,145,150,110,120,130,140,150,160,170,110,130,150,170,185,200,210,220,120,145,170,190,200,220,225,235,170,190,220,240,250,260,270,280,190,210,240,265,280,290,300,310]
[null,"INTERNATIONAL B",80,85,95,100,110,120,130,90,95,105,100,125,135,145,110,120,130,140,150,160,170,125,140,150,160,170,180,190,120,145,170,190,200,220,225,235,135,170,190,210,220,240,250,260,190,210,240,260,280,290,300,310,210,230,260,285,300,310,325,330]
[null,"INTERNATIONAL A",90,95,105,115,125,135,145,100,110,120,115,140,150,160,125,135,150,160,170,180,190,140,160,170,180,190,195,210,135,170,190,210,220,240,250,260,150,190,210,230,250,260,280,280,210,230,250,285,300,310,325,330,225,255,275,305,325,330,345,355]
[null,"OLYMPIQUE",1000,1000,1000,1000,1000,1000,1000,1000,1000,1000,1000,1000,1000,1000,1000,1000,1000,1000,1000,1000,1000,155,175,190,200,205,210,225,1000,1000,1000,1000,1000,10000,1000,1000,1000,1000,1000,1000,1000,10000,1000,1000,1000,1000,1000,10000,1000,1000,1000,10000,240,270,290,320,345,355,365,375]
[null,"MINIME","CADET","CADET","JUNIOR","SENIOR",null,"MINIME","CADETTE","CADETTE","JUNIOR","SENIOR"]
[20.010000000000002,"NON","C1 50","C2 50","J56","S56",20.010000000000002,"NON","FC1 44","FC2 44","FJ48","FS48"]
[34.01,"NON","C1 50","C2 50","J56","S56",30.01,"NON","FC1 44","FC2 44","FJ48","FS48"]
[38.01,"NON","C1 50","C2 50","J56","S56",35.01,"NON","FC1 44","FC2 44","FJ48","FS48"]
[40.01,"NON","C1 50","C2 50","J56","S56",36.01,"NON","FC1 44","FC2 44","FJ48","FS48"]
[45.01,"NON","C1 50","C2 50","J56","S56",40.01,"NON","FC1 44","FC2 44","FJ48","FS48"]
[50.01,"NON","C1 56","C2 56","J56","S56",44.01,"NON","FC1 48","FC2 48","FJ48","FS48"]
[52.05,"NON","C1 56","C2 56","J56","S56",48.01,"NON","FC1 53","FC2 53","FJ53","FS53"]
[56.01,"NON","C1 62","C2 62","J62","S62",53.01,"NON","FC1 58","FC2 58","FJ58","FS58"]
[62.01,"NON","C1 69","C2 69","J69","S69",58.01,"NON","FC1 63","FC2 63","FJ63","FS63"]
[69.010000000000005,"NON","C1 77","C2 77","J77","S77",63.01,"NON","FC1 69","FC2 69","FJ69","FS69"]
[77.010000000000005,"NON","C1 85","C2 85","J85","S85",69.010000000000005,"NON","FC1 +69","FC2 +69","FJ75","FS75"]
[85.01,"NON","C1 94","C2 94","J94","S94",75.010000000000005,"NON","FC1 +69","FC2 +69","FJ+75","FS+75"]
[94.01,"NON","C1 +94","C2 +94","J105","S105",110,"NON","FC1 +69","FC2 +69","FJ+75","FS+75"]
[105.01,"NON","C1 +94","C2 +94","J+105","S+105",140,"NON","FC1 +69","FC2 +69","FJ+75","FS+75"]
[110,"NON","C1 +94","C2 +94","J+105","S+105"]
[120,"NON","C1 +94","C2 +94","J+105","S+105"]
[130,"NON","C1 +94","C2 +94","J+105","S+105"]
[140,"NON","C1 +94","C2 +94","J+105","S+105",null,null,null,null,null,null,null,null,null,null,null,null,null,null,null,null,null,null,null,null,null,null,null,null,null," "]

{"sheet":"MATCH","index":1,"n_rows":525,"n_cols":49,"rows_kept":525,"cut":false,"hidden":false,"merged":[[1,3,1,11],[3,20,3,21],[16,20,16,22],[14,1,14,2],[14,6,14,12],[15,1,15,2],[16,1,16,2],[16,6,16,9],[16,12,16,15]]}
[null,"EPREUVE :"," ","CHAMPIONNATS DU MONDE SENIORS D'HALTEROPHILIE",null,null,null,null,null,null,null,null,null,null,null,"DATE : Du 8 au 16 novembre 2014"]
[null,"LIEU :"," ","LIEU : Almaty (Kazakhstan)"]
[]
["SEXE","NOM","Prénom","An","Poids","Nation","Nat.",1,2,3,"Arr.","Cl.Arr.",1,2,3,"Ep-J.","Cl.Ep-J.","Total",null,"Class. Final","Serie",null,"Cat.","IWF",null," ","DEB ","DEP +","REG +","IRG +","FED +","NAT +","INTB +","INTA +","OLY +"]
["H","AUCOUTURIER","Yann",1986,67.91,"France","F",-125,125,-130,{"$f":"IF(D5=\"\",\"\",IF(MAXA(H5:J5)<=0,0,MAXA(H5:J5)))","v":125},"33e",-161,161,-166,{"$f":"IF(D5=\"\",\"\",IF(MAXA(M5:O5)<=0,0,MAXA(M5:O5)))","v":161},"23e",{"$f":"IF(D5=\"\",\"\",IF(OR(K5=0,P5=0),0,K5+P5))","v":286},null,"26e",{"$f":"IF(D5=\"\",\"\",AP5)","v":"INTA +"},{"$f":"IF(AI5>=0,AI5,IF(AH5>=0,AH5,IF(AG5>=0,AG5,IF(AF5>=0,AF5,IF(AE5>=0,AE5,IF(AD5>=0,AD5,IF(AC5>=0,AC5,IF(AB5>=0,AB5,AA5))))))))","v":11},{"$f":"IF(E5=\"\",\"\",IF(A5=\"H\",IF(OR(D5=\"SEN\",D5<1995),VLOOKUP(E5,Feuil1!$A$11:$F$29,6),IF(AND(D5>1994,D5<1998),VLOOKUP(E5,Feuil1!$A$11:$F$29,5),IF(AND(D5>1997,D5<2000),VLOOKUP(E5,Feuil1!$A$11:$F$29,4),IF(AND(D5>1999,D5<2002),VLOOKUP(E5,Feuil1!$A$11:$F$29,3),VLOOKUP(E5,Feuil1!$A$11:$F$29,2))))),IF(OR(D5=\"SEN\",D5<1995),VLOOKUP(E5,Feuil1!$G$11:$L$25,6),IF(AND(D5>1994,D5<1998),VLOOKUP(E5,Feuil1!$G$11:$L$25,5),IF(AND(D5>1997,D5<2000),VLOOKUP(E5,Feuil1!$G$11:$L$25,4),IF(AND(D5>1999,D5<2002),VLOOKUP(E5,Feuil1!$G$11:$L$25,3),VLOOKUP(E5,Feuil1!$G$11:$L$25,2)))))))","v":"S69"},{"$f":"IF(E5=\"\",\"\",IF(A5=\"H\",10^(0.794358141*LOG(E5/174.393)^2)*R5,IF(A5=\"F\",10^(0.89726074*LOG(E5/148.026)^2)*R5,\"\")))","v":388.71756688991115},null," ",156,136,116,96,66,46,26,11,-4,null,null,null,null,null,null,{"$f":"IF(AI5>=0,$AI$4,IF(AH5>=0,$AH$4,IF(AG5>=0,$AG$4,IF(AF5>=0,$AF$4,IF(AE5>=0,$AE$4,IF(AD5>=0,$AD$4,IF(AC5>=0,$AC$4,IF(AB5>=0,$AB$4,$AA$4))))))))","v":"INTA +"}]
["H","KINGUE-MATAM","Bernardin",1990,68.66,"France","F",138,142,-145,{"$f":"IF(D6=\"\",\"\",IF(MAXA(H6:J6)<=0,0,MAXA(H6:J6)))","v":142},"10e",173,177,-182,{"$f":"IF(D6=\"\",\"\",IF(MAXA(M6:O6)<=0,0,MAXA(M6:O6)))","v":177},"6e",{"$f":"IF(D6=\"\",\"\",IF(OR(K6=0,P6=0),0,K6+P6))","v":319},null,"7e",{"$f":"IF(D6=\"\",\"\",AP6)","v":"OLY +"},{"$f":"IF(AI6>=0,AI6,IF(AH6>=0,AH6,IF(AG6>=0,AG6,IF(AF6>=0,AF6,IF(AE6>=0,AE6,IF(AD6>=0,AD6,IF(AC6>=0,AC6,IF(AB6>=0,AB6,AA6))))))))","v":29},{"$f":"IF(E6=\"\",\"\",IF(A6=\"H\",IF(OR(D6=\"SEN\",D6<1995),VLOOKUP(E6,Feuil1!$A$11:$F$29,6),IF(AND(D6>1994,D6<1998),VLOOKUP(E6,Feuil1!$A$11:$F$29,5),IF(AND(D6>1997,D6<2000),VLOOKUP(E6,Feuil1!$A$11:$F$29,4),IF(AND(D6>1999,D6<2002),VLOOKUP(E6,Feuil1!$A$11:$F$29,3),VLOOKUP(E6,Feuil1!$A$11:$F$29,2))))),IF(OR(D6=\"SEN\",D6<1995),VLOOKUP(E6,Feuil1!$G$11:$L$25,6),IF(AND(D6>1994,D6<1998),VLOOKUP(E6,Feuil1!$G$11:$L$25,5),IF(AND(D6>1997,D6<2000),VLOOKUP(E6,Feuil1!$G$11:$L$25,4),IF(AND(D6>1999,D6<2002),VLOOKUP(E6,Feuil1!$G$11:$L$25,3),VLOOKUP(E6,Feuil1!$G$11:$L$25,2)))))))","v":"S69"},430.49970851384421,null," ",189,169,149,129,99,79,59,44,29,null,null,null,null,null,null,{"$f":"IF(AI6>=0,$AI$4,IF(AH6>=0,$AH$4,IF(AG6>=0,$AG$4,IF(AF6>=0,$AF$4,IF(AE6>=0,$AE$4,IF(AD6>=0,$AD$4,IF(AC6>=0,$AC$4,IF(AB6>=0,$AB$4,$AA$4))))))))","v":"OLY +"}]
["H","BARDIS","Giovanni",1987,84.77,"France","F",-156,156,160,160,"15e",185,191,-194,191,"21e",351,null,"17e","OLY +",6,{"$f":"IF(E7=\"\",\"\",IF(A7=\"H\",IF(OR(D7=\"SEN\",D7<1995),VLOOKUP(E7,Feuil1!$A$11:$F$29,6),IF(AND(D7>1994,D7<1998),VLOOKUP(E7,Feuil1!$A$11:$F$29,5),IF(AND(D7>1997,D7<2000),VLOOKUP(E7,Feuil1!$A$11:$F$29,4),IF(AND(D7>1999,D7<2002),VLOOKUP(E7,Feuil1!$A$11:$F$29,3),VLOOKUP(E7,Feuil1!$A$11:$F$29,2))))),IF(OR(D7=\"SEN\",D7<1995),VLOOKUP(E7,Feuil1!$G$11:$L$25,6),IF(AND(D7>1994,D7<1998),VLOOKUP(E7,Feuil1!$G$11:$L$25,5),IF(AND(D7>1997,D7<2000),VLOOKUP(E7,Feuil1!$G$11:$L$25,4),IF(AND(D7>1999,D7<2002),VLOOKUP(E7,Feuil1!$G$11:$L$25,3),VLOOKUP(E7,Feuil1!$G$11:$L$25,2)))))))","v":"S85"},420.02225638986903,null," ",186,166,146,126,101,71,51,26,6,null,null,null,null,null,null,"OLY +"]
["H","HENNEQUIN","Benjamin",1984,84.52,"France","F",152,157,160,160,"13e",-200,200,-211,200,"11e",360,null,"11e","OLY +",15,{"$f":"IF(E8=\"\",\"\",IF(A8=\"H\",IF(OR(D8=\"SEN\",D8<1995),VLOOKUP(E8,Feuil1!$A$11:$F$29,6),IF(AND(D8>1994,D8<1998),VLOOKUP(E8,Feuil1!$A$11:$F$29,5),IF(AND(D8>1997,D8<2000),VLOOKUP(E8,Feuil1!$A$11:$F$29,4),IF(AND(D8>1999,D8<2002),VLOOKUP(E8,Feuil1!$A$11:$F$29,3),VLOOKUP(E8,Feuil1!$A$11:$F$29,2))))),IF(OR(D8=\"SEN\",D8<1995),VLOOKUP(E8,Feuil1!$G$11:$L$25,6),IF(AND(D8>1994,D8<1998),VLOOKUP(E8,Feuil1!$G$11:$L$25,5),IF(AND(D8>1997,D8<2000),VLOOKUP(E8,Feuil1!$G$11:$L$25,4),IF(AND(D8>1999,D8<2002),VLOOKUP(E8,Feuil1!$G$11:$L$25,3),VLOOKUP(E8,Feuil1!$G$11:$L$25,2)))))))","v":"S85"},431.42710108540433,null," ",195,175,155,135,110,80,60,35,15,null,null,null,null,null,null,"OLY +"]
["H","MATAM-MATAM","David",1975,93.17,"France","F",155,160,-163,160,"20e",190,193,-195,{"$f":"IF(D9=\"\",\"\",IF(MAXA(M9:O9)<=0,0,MAXA(M9:O9)))","v":193},"17e",{"$f":"IF(D9=\"\",\"\",IF(OR(K9=0,P9=0),0,K9+P9))","v":353},null,"19e",{"$f":"IF(D9=\"\",\"\",AP9)","v":"INTA +"},23,{"$f":"IF(E9=\"\",\"\",IF(A9=\"H\",IF(OR(D9=\"SEN\",D9<1995),VLOOKUP(E9,Feuil1!$A$11:$F$29,6),IF(AND(D9>1994,D9<1998),VLOOKUP(E9,Feuil1!$A$11:$F$29,5),IF(AND(D9>1997,D9<2000),VLOOKUP(E9,Feuil1!$A$11:$F$29,4),IF(AND(D9>1999,D9<2002),VLOOKUP(E9,Feuil1!$A$11:$F$29,3),VLOOKUP(E9,Feuil1!$A$11:$F$29,2))))),IF(OR(D9=\"SEN\",D9<1995),VLOOKUP(E9,Feuil1!$G$11:$L$25,6),IF(AND(D9>1994,D9<1998),VLOOKUP(E9,Feuil1!$G$11:$L$25,5),IF(AND(D9>1997,D9<2000),VLOOKUP(E9,Feuil1!$G$11:$L$25,4),IF(AND(D9>1999,D9<2002),VLOOKUP(E9,Feuil1!$G$11:$L$25,3),VLOOKUP(E9,Feuil1!$G$11:$L$25,2)))))))","v":"S94"},404.25356433226375,null," ",183,163,138,118,93,63,43,23,-2,null,null,null,null,null,null,{"$f":"IF(AI9>=0,$AI$4,IF(AH9>=0,$AH$4,IF(AG9>=0,$AG$4,IF(AF9>=0,$AF$4,IF(AE9>=0,$AE$4,IF(AD9>=0,$AD$4,IF(AC9>=0,$AC$4,IF(AB9>=0,$AB$4,$AA$4))))))))","v":"INTA +"}]
["F","MICHEL","Anaïs",1988,47.82,"France","F",73,75,-77,{"$f":"IF(D10=\"\",\"\",IF(MAXA(H10:J10)<=0,0,MAXA(H10:J10)))","v":75},"16e",93,96,-98,96,"11e",171,null,"13e","OLY +",{"$f":"IF(AI10>=0,AI10,IF(AH10>=0,AH10,IF(AG10>=0,AG10,IF(AF10>=0,AF10,IF(AE10>=0,AE10,IF(AD10>=0,AD10,IF(AC10>=0,AC10,IF(AB10>=0,AB10,AA10))))))))","v":16},{"$f":"IF(E10=\"\",\"\",IF(A10=\"H\",IF(OR(D10=\"SEN\",D10<1995),VLOOKUP(E10,Feuil1!$A$11:$F$29,6),IF(AND(D10>1994,D10<1998),VLOOKUP(E10,Feuil1!$A$11:$F$29,5),IF(AND(D10>1997,D10<2000),VLOOKUP(E10,Feuil1!$A$11:$F$29,4),IF(AND(D10>1999,D10<2002),VLOOKUP(E10,Feuil1!$A$11:$F$29,3),VLOOKUP(E10,Feuil1!$A$11:$F$29,2))))),IF(OR(D10=\"SEN\",D10<1995),VLOOKUP(E10,Feuil1!$G$11:$L$25,6),IF(AND(D10>1994,D10<1998),VLOOKUP(E10,Feuil1!$G$11:$L$25,5),IF(AND(D10>1997,D10<2000),VLOOKUP(E10,Feuil1!$G$11:$L$25,4),IF(AND(D10>1999,D10<2002),VLOOKUP(E10,Feuil1!$G$11:$L$25,3),VLOOKUP(E10,Feuil1!$G$11:$L$25,2)))))))","v":"FS48"},281.23502817293343,null," ",116,106,96,86,76,61,46,31,16,null,null,null,null,null,null,"OLY +"]
["F","LORENTZ","Manon",1991,50.13,"France","F",-77,77,80,80,"16e",92,-95,-95,92,"27e",172,null,"25e","INTA +",12,{"$f":"IF(E11=\"\",\"\",IF(A11=\"H\",IF(OR(D11=\"SEN\",D11<1995),VLOOKUP(E11,Feuil1!$A$11:$F$29,6),IF(AND(D11>1994,D11<1998),VLOOKUP(E11,Feuil1!$A$11:$F$29,5),IF(AND(D11>1997,D11<2000),VLOOKUP(E11,Feuil1!$A$11:$F$29,4),IF(AND(D11>1999,D11<2002),VLOOKUP(E11,Feuil1!$A$11:$F$29,3),VLOOKUP(E11,Feuil1!$A$11:$F$29,2))))),IF(OR(D11=\"SEN\",D11<1995),VLOOKUP(E11,Feuil1!$G$11:$L$25,6),IF(AND(D11>1994,D11<1998),VLOOKUP(E11,Feuil1!$G$11:$L$25,5),IF(AND(D11>1997,D11<2000),VLOOKUP(E11,Feuil1!$G$11:$L$25,4),IF(AND(D11>1999,D11<2002),VLOOKUP(E11,Feuil1!$G$11:$L$25,3),VLOOKUP(E11,Feuil1!$G$11:$L$25,2)))))))","v":"FS53"},271.60394295767867,null," ",107,97,87,77,67,52,32,12,-3,null,null,null,null,null,null,"INTA +"]
["F","TCHAKOUNTE","Dora",1995,56.48,"France","F",80,84,87,87,"18e",96,100,-104,100,"25e",187,null,"25e","INTA +",37,{"$f":"IF(E12=\"\",\"\",IF(A12=\"H\",IF(OR(D12=\"SEN\",D12<1995),VLOOKUP(E12,Feuil1!$A$11:$F$29,6),IF(AND(D12>1994,D12<1998),VLOOKUP(E12,Feuil1!$A$11:$F$29,5),IF(AND(D12>1997,D12<2000),VLOOKUP(E12,Feuil1!$A$11:$F$29,4),IF(AND(D12>1999,D12<2002),VLOOKUP(E12,Feuil1!$A$11:$F$29,3),VLOOKUP(E12,Feuil1!$A$11:$F$29,2))))),IF(OR(D12=\"SEN\",D12<1995),VLOOKUP(E12,Feuil1!$G$11:$L$25,6),IF(AND(D12>1994,D12<1998),VLOOKUP(E12,Feuil1!$G$11:$L$25,5),IF(AND(D12>1997,D12<2000),VLOOKUP(E12,Feuil1!$G$11:$L$25,4),IF(AND(D12>1999,D12<2002),VLOOKUP(E12,Feuil1!$G$11:$L$25,3),VLOOKUP(E12,Feuil1!$G$11:$L$25,2)))))))","v":"FJ58"},268.50186330124143,null," ",127,117,107,97,87,72,57,37,-813,null,null,null,null,null,null,"INTA +"]
["F","NAYO-KETCHANKE","Gaëlle",1988,73.349999999999994,"France","F",100,104,107,107,"9e",125,-131,131,131,"9e",238,null,"8e","OLY +",28,{"$f":"IF(E13=\"\",\"\",IF(A13=\"H\",IF(OR(D13=\"SEN\",D13<1995),VLOOKUP(E13,Feuil1!$A$11:$F$29,6),IF(AND(D13>1994,D13<1998),VLOOKUP(E13,Feuil1!$A$11:$F$29,5),IF(AND(D13>1997,D13<2000),VLOOKUP(E13,Feuil1!$A$11:$F$29,4),IF(AND(D13>1999,D13<2002),VLOOKUP(E13,Feuil1!$A$11:$F$29,3),VLOOKUP(E13,Feuil1!$A$11:$F$29,2))))),IF(OR(D13=\"SEN\",D13<1995),VLOOKUP(E13,Feuil1!$G$11:$L$25,6),IF(AND(D13>1994,D13<1998),VLOOKUP(E13,Feuil1!$G$11:$L$25,5),IF(AND(D13>1997,D13<2000),VLOOKUP(E13,Feuil1!$G$11:$L$25,4),IF(AND(D13>1999,D13<2002),VLOOKUP(E13,Feuil1!$G$11:$L$25,3),VLOOKUP(E13,Feuil1!$G$11:$L$25,2)))))))","v":"FS75"},288.41021864518041,null," ",143,133,123,108,93,78,58,43,28,null,null,null,null,null,null,"OLY +"]
["F","YAMECHI","Madeleine",1982,83.84,"France","F",88,90,-94,90,"24e",110,113,-115,113,"24e",203,null,"24e","INTB +",13,{"$f":"IF(E14=\"\",\"\",IF(A14=\"H\",IF(OR(D14=\"SEN\",D14<1995),VLOOKUP(E14,Feuil1!$A$11:$F$29,6),IF(AND(D14>1994,D14<1998),VLOOKUP(E14,Feuil1!$A$11:$F$29,5),IF(AND(D14>1997,D14<2000),VLOOKUP(E14,Feuil1!$A$11:$F$29,4),IF(AND(D14>1999,D14<2002),VLOOKUP(E14,Feuil1!$A$11:$F$29,3),VLOOKUP(E14,Feuil1!$A$11:$F$29,2))))),IF(OR(D14=\"SEN\",D14<1995),VLOOKUP(E14,Feuil1!$G$11:$L$25,6),IF(AND(D14>1994,D14<1998),VLOOKUP(E14,Feuil1!$G$11:$L$25,5),IF(AND(D14>1997,D14<2000),VLOOKUP(E14,Feuil1!$G$11:$L$25,4),IF(AND(D14>1999,D14<2002),VLOOKUP(E14,Feuil1!$G$11:$L$25,3),VLOOKUP(E14,Feuil1!$G$11:$L$25,2)))))))","v":"FS+75"},230.24320663858629,null," ",103,93,78,63,53,33,13,-7,-22,null,null,null,null,null,null,"INTB +"]
[null,null,null,null,null,null,null,null,null,null,null,null,null,null,null,null,null,null,null,null,null,null,null,null,null," ",{"$error":"#N/A"},{"$error":"#N/A"},{"$error":"#N/A"},{"$error":"#N/A"},{"$error":"#N/A"},{"$error":"#N/A"},{"$error":"#N/A"},{"$error":"#N/A"},{"$error":"#N/A"},null,null,null,null,null,null,{"$error":"#N/A"}]
[null,null,null,null,null,null,null,null,null,null,null,null,null,null,null,null,null,null,null,null,null,null,null,null,null," ",{"$error":"#N/A"},{"$error":"#N/A"},{"$error":"#N/A"},{"$error":"#N/A"},{"$error":"#N/A"},{"$error":"#N/A"},{"$error":"#N/A"},{"$error":"#N/A"},{"$error":"#N/A"},null,null,null,null,null,null,{"$error":"#N/A"}]
[null,null,null,null,null,null,null,null,null,null,null,null,null,null,null,null,null,null,null,null,null,null,null,null,null," ",{"$error":"#N/A"},{"$error":"#N/A"},{"$error":"#N/A"},{"$error":"#N/A"},{"$error":"#N/A"},{"$error":"#N/A"},{"$error":"#N/A"},{"$error":"#N/A"},{"$error":"#N/A"},null,null,null,null,null,null,{"$error":"#N/A"}]
[]
[]
[]
[]
[]
[]
[]
[]
[]
[]
[]
[]
[]
[]
[]
[]
[]
[]
[]
[]
[]
[]
[]
[]
[]
[]
[]
[]
[]
[]
[]
[]
[]
[]
[]
[]
[]
[]
[]
[]
[]
[]
[]
[]
[]
[]
[]
[]
[]
[]
[]
[]
[]
[]
[]
[]
[]
[]
[]
[]
[]
[]
[]
[]
[]
[]
[]
[]
[]
[]
[]
[]
[]
[]
[]
[]
[]
[]
[]
[]
[]
[]
[]
[]
[]
[]
[]
[]
[]
[]
[]
[]
[]
[]
[]
[]
[]
[]
[]
[]
[]
[]
[]
[]
[]
[]
[]
[]
[]
[]
[]
[]
[]
[]
[]
[]
[]
[]
[]
[]
[]
[]
[]
[]
[]
[]
[]
[]
[]
[]
[]
[]
[]
[]
[]
[]
[]
[]
[]
[]
[]
[]
[]
[]
[]
[]
[]
[]
[]
[]
[]
[]
[]
[]
[]
[]
[]
[]
[]
[]
[]
[]
[]
[]
[]
[]
[]
[]
[]
[]
[]
[]
[]
[]
[]
[]
[]
[]
[]
[]
[]
[]
[]
[]
[]
[]
[]
[]
[]
[]
[]
[]
[]
[]
[]
[]
[]
[]
[]
[]
[]
[]
[]
[]
[]
[]
[]
[]
[]
[]
[]
[]
[]
[]
[]
[]
[]
[]
[]
[]
[]
[]
[]
[]
[]
[]
[]
[]
[]
[]
[]
[]
[]
[]
[]
[]
[]
[]
[]
[]
[]
[]
[]
[]
[]
[]
[]
[]
[]
[]
[]
[]
[]
[]
[]
[]
[]
[]
[]
[]
[]
[]
[]
[]
[]
[]
[]
[]
[]
[]
[]
[]
[]
[]
[]
[]
[]
[]
[]
[]
[]
[]
[]
[]
[]
[]
[]
[]
[]
[]
[]
[]
[]
[]
[]
[]
[]
[]
[]
[]
[]
[]
[]
[]
[]
[]
[]
[]
[]
[]
[]
[]
[]
[]
[]
[]
[]
[]
[]
[]
[]
[]
[]
[]
[]
[]
[]
[]
[]
[]
[]
[]
[]
[]
[]
[]
[]
[]
[]
[]
[]
[]
[]
[]
[]
[]
[]
[]
[]
[]
[]
[]
[]
[]
[]
[]
[]
[]
[]
[]
[]
[]
[]
[]
[]
[]
[]
[]
[]
[]
[]
[]
[]
[]
[]
[]
[]
[]
[]
[]
[]
[]
[]
{"$rows_left_out":125}