{"text_format":"1","workbook":"xlsx","n_sheets":3,"sheets":["MINIMES FILLES","MINIMES GARCONS","Feuil1"],"not_rendered":{"charts":0,"images":0,"macros":1,"external_links":2,"defined_names":4,"comments":2,"pivot_tables":0},"unopened":[],"bounds":{"document_bytes":16777216,"sheet_cells":100000,"rows_first":2000,"rows_last":500,"rows_between":2000,"halvings":0,"cell_chars":16384,"cell_head_chars":4096},"cells_cut":0,"cells_raw":0,"read":"whole","date_system":"1900"}

{"sheet":"MINIMES FILLES","index":0,"n_rows":561,"n_cols":48,"rows_kept":561,"cut":false,"hidden":false,"merged":[[0,6,0,14],[0,18,0,21],[1,5,1,10],[1,11,1,13],[1,14,1,17],[1,18,1,19],[1,21,1,22]]}
[null,null,null,"LISTING NATIONAL",null,null,"MINIMES FILLES",null,null,null,null,null,null,null,null,null,"DATE :",null,"2015-06-30"]
[null,null,null," ",null,"2014-2015",null,null,null,null,null,"3° TRIMESTRE"]
[]
["SEXE","ZONE","REG.","Place","LICENCE","NOMS","Prénoms","AN","POIDS","CLUB","NAT",1,2,3,"ARR",1,2,3,"EP-J","TOTAL","IWF","Points",null,"Catég"," ","DEP +","REG +","IRG +","FED +","NAT +","INTB +","INTA +","OLY +","NCL"]
[null,null,null,null,null,null,null,null,null,null,null,null,null,null,null,null,null,null,null,null,null,null,null,null,null,null," ",{"$f":"T5-HLOOKUP(X5,[1]Feuil1!$C$1:$BL$10,2,FALSE)","v":{"$error":"#N/A"}},{"$f":"T5-HLOOKUP(X5,[1]Feuil1!$C$1:$BL$10,3,FALSE)","v":{"$error":"#N/A"}},{"$f":"T5-HLOOKUP(X5,[1]Feuil1!$C$1:$BL$10,4,FALSE)","v":{"$error":"#N/A"}},{"$f":"T5-HLOOKUP(X5,[1]Feuil1!$C$1:$BL$10,5,FALSE)","v":{"$error":"#N/A"}},{"$f":"T5-HLOOKUP(X5,[1]Feuil1!$C$1:$BL$10,6,FALSE)","v":{"$error":"#N/A"}},{"$f":"T5-HLOOKUP(X5,[1]Feuil1!$C$1:$BL$10,7,FALSE)","v":{"$error":"#N/A"}},{"$f":"T5-HLOOKUP(X5,[1]Feuil1!$C$1:$BL$10,8,FALSE)","v":{"$error":"#N/A"}},{"$f":"T5-HLOOKUP(X5,[1]Feuil1!$C$1:$BL$10,9,FALSE)","v":{"$error":"#N/A"}},{"$f":"T5-HLOOKUP(X5,[1]Feuil1!$C$1:$BL$10,10,FALSE)","v":{"$error":"#N/A"}},null,null,null,null,null,null,{"$f":"IF(AJ5>=0,$AJ$4,IF(AI5>=0,$AI$4,IF(AH5>=0,$AH$4,IF(AG5>=0,$AG$4,IF(AF5>=0,$AF$4,IF(AE5>=0,$AE$4,IF(AD5>=0,$AD$4,IF(AC5>=0,$AC$4,$AB$4))))))))","v":{"$error":"#N/A"}}]
["F","SEST","RAL",1,352111,"PICOT","Zianne",2003,38,"CH Saint Baldoph","F",20,22,-24,{"$f":"IF(MAXA(L6+M6,M6+N6,L6+N6,L6,M6,N6)<=0,0,MAXA(L6+M6,M6+N6,L6+N6,L6,M6,N6))","v":42},29,31,33,{"$f":"IF(MAXA(P6+Q6,Q6+R6,P6+R6,P6,Q6,R6)<=0,0,MAXA(P6+Q6,Q6+R6,P6+R6,P6,Q6,R6))","v":64},{"$f":"IF(H6=\"\",\"\",IF(OR(O6=0,S6=0),0,O6+S6))","v":106},{"$f":"IF(I6=\"\",\"\",IF(A6=\"H\",10^(0.794358141*LOG(I6/174.393)^2)*T6,IF(A6=\"F\",10^(0.89726074 * LOG(I6/148.026)^2)*T6,\"\")))","v":217.88613387138508},{"$f":"SUM(T6-I6)","v":68},null,{"$f":"IF(A6=\"F\",(IF(OR(H6>2001,H6<2004),VLOOKUP(I6,Feuil1!$G$11:$H$25,2))),IF(A6=\"H\",(IF(OR(H6>2001,H6<2004),VLOOKUP(I6,Feuil1!$A$11:$F$29,2)))))","v":"FM40"},null,{"$f":"T6-HLOOKUP(X6,#REF!,2,FALSE)","v":{"$error":"#REF!"}},{"$f":"T6-HLOOKUP(X6,#REF!,3,FALSE)","v":{"$error":"#REF!"}},{"$f":"T6-HLOOKUP(X6,#REF!,4,FALSE)","v":{"$error":"#REF!"}},{"$f":"T6-HLOOKUP(X6,#REF!,5,FALSE)","v":{"$error":"#REF!"}},{"$f":"T6-HLOOKUP(X6,#REF!,6,FALSE)","v":{"$error":"#REF!"}},{"$f":"T6-HLOOKUP(X6,#REF!,7,FALSE)","v":{"$error":"#REF!"}},{"$f":"T6-HLOOKUP(X6,#REF!,8,FALSE)","v":{"$error":"#REF!"}},{"$f":"T6-HLOOKUP(X6,#REF!,9,FALSE)","v":{"$error":"#REF!"}},null,null,null,null,null,null,null,{"$f":"IF(AG6>=0,$AG$4,IF(AF6>=0,$AF$4,IF(AE6>=0,$AE$4,IF(AD6>=0,$AD$4,IF(AC6>=0,$AC$4,IF(AB6>=0,$AB$4,IF(AA6>=0,$AA$4,IF(Z6>=0,$Z$4,$AH$4))))))))","v":{"$error":"#REF!"}}]
["F","CO","PDL",2,386516,"ABRAHAM","Ines-Sarah",2002,39.799999999999997,"CJF LAVAL - VOUTRÉ","F",22,24,26,50,-26,26,27,53,103,201.75428345010693,63.2,null,{"$f":"IF(A7=\"F\",(IF(OR(H7>2001,H7<2004),VLOOKUP(I7,Feuil1!$G$11:$H$25,2))),IF(A7=\"H\",(IF(OR(H7>2001,H7<2004),VLOOKUP(I7,Feuil1!$A$11:$F$29,2)))))","v":"FM40"},null,{"$f":"T7-HLOOKUP(X7,#REF!,2,FALSE)","v":{"$error":"#REF!"}},{"$f":"T7-HLOOKUP(X7,#REF!,3,FALSE)","v":{"$error":"#REF!"}},{"$f":"T7-HLOOKUP(X7,#REF!,4,FALSE)","v":{"$error":"#REF!"}},{"$f":"T7-HLOOKUP(X7,#REF!,5,FALSE)","v":{"$error":"#REF!"}},{"$f":"T7-HLOOKUP(X7,#REF!,6,FALSE)","v":{"$error":"#REF!"}},{"$f":"T7-HLOOKUP(X7,#REF!,7,FALSE)","v":{"$error":"#REF!"}},{"$f":"T7-HLOOKUP(X7,#REF!,8,FALSE)","v":{"$error":"#REF!"}},{"$f":"T7-HLOOKUP(X7,#REF!,9,FALSE)","v":{"$error":"#REF!"}},null,null,null,null,null,null,null,{"$error":"#REF!"}]
["F","NE","ALS",3,354663,"SCHULTZ","LEANE",2003,38.35,"US Wittenheim","F",17,19,21,40,25,27,29,56,96,195.42919978501948,57.65,null,{"$f":"IF(A8=\"F\",(IF(OR(H8>2001,H8<2004),VLOOKUP(I8,Feuil1!$G$11:$H$25,2))),IF(A8=\"H\",(IF(OR(H8>2001,H8<2004),VLOOKUP(I8,Feuil1!$A$11:$F$29,2)))))","v":"FM40"},null,{"$f":"T8-HLOOKUP(X8,#REF!,2,FALSE)","v":{"$error":"#REF!"}},{"$f":"T8-HLOOKUP(X8,#REF!,3,FALSE)","v":{"$error":"#REF!"}},{"$f":"T8-HLOOKUP(X8,#REF!,4,FALSE)","v":{"$error":"#REF!"}},{"$f":"T8-HLOOKUP(X8,#REF!,5,FALSE)","v":{"$error":"#REF!"}},{"$f":"T8-HLOOKUP(X8,#REF!,6,FALSE)","v":{"$error":"#REF!"}},{"$f":"T8-HLOOKUP(X8,#REF!,7,FALSE)","v":{"$error":"#REF!"}},{"$f":"T8-HLOOKUP(X8,#REF!,8,FALSE)","v":{"$error":"#REF!"}},{"$f":"T8-HLOOKUP(X8,#REF!,9,FALSE)","v":{"$error":"#REF!"}},null,null,null,null,null,null,null,{"$error":"#REF!"}]
["F","NORD","PIC",4,386173,"POTARD","Cindy",2002,32.4,"Péronne AAEEP","F",16,18,19,37,22,24,26,50,87,213.85573148390637,54.6,null,{"$f":"IF(A9=\"F\",(IF(OR(H9>2001,H9<2004),VLOOKUP(I9,Feuil1!$G$11:$H$25,2))),IF(A9=\"H\",(IF(OR(H9>2001,H9<2004),VLOOKUP(I9,Feuil1!$A$11:$F$29,2)))))","v":"FM36"},null,{"$f":"T9-HLOOKUP(X9,#REF!,2,FALSE)","v":{"$error":"#REF!"}},{"$f":"T9-HLOOKUP(X9,#REF!,3,FALSE)","v":{"$error":"#REF!"}},{"$f":"T9-HLOOKUP(X9,#REF!,4,FALSE)","v":{"$error":"#REF!"}},{"$f":"T9-HLOOKUP(X9,#REF!,5,FALSE)","v":{"$error":"#REF!"}},{"$f":"T9-HLOOKUP(X9,#REF!,6,FALSE)","v":{"$error":"#REF!"}},{"$f":"T9-HLOOKUP(X9,#REF!,7,FALSE)","v":{"$error":"#REF!"}},{"$f":"T9-HLOOKUP(X9,#REF!,8,FALSE)","v":{"$error":"#REF!"}},{"$f":"T9-HLOOKUP(X9,#REF!,9,FALSE)","v":{"$error":"#REF!"}},null,null,null,null,null,null,null,{"$error":"#REF!"}]
["F","NORD","PIC",5,391502,"QUIN-PLOYARD","Ludivine",2002,40,"Saleux CHM","F",13,15,-17,28,15,17,19,36,64,124.72148323808392,24,null,{"$f":"IF(A10=\"F\",(IF(OR(H10>2001,H10<2004),VLOOKUP(I10,Feuil1!$G$11:$H$25,2))),IF(A10=\"H\",(IF(OR(H10>2001,H10<2004),VLOOKUP(I10,Feuil1!$A$11:$F$29,2)))))","v":"FM40"},null,{"$f":"T10-HLOOKUP(X10,#REF!,2,FALSE)","v":{"$error":"#REF!"}},{"$f":"T10-HLOOKUP(X10,#REF!,3,FALSE)","v":{"$error":"#REF!"}},{"$f":"T10-HLOOKUP(X10,#REF!,4,FALSE)","v":{"$error":"#REF!"}},{"$f":"T10-HLOOKUP(X10,#REF!,5,FALSE)","v":{"$error":"#REF!"}},{"$f":"T10-HLOOKUP(X10,#REF!,6,FALSE)","v":{"$error":"#REF!"}},{"$f":"T10-HLOOKUP(X10,#REF!,7,FALSE)","v":{"$error":"#REF!"}},{"$f":"T10-HLOOKUP(X10,#REF!,8,FALSE)","v":{"$error":"#REF!"}},{"$f":"T10-HLOOKUP(X10,#REF!,9,FALSE)","v":{"$error":"#REF!"}},null,null,null,null,null,null,null,{"$error":"#REF!"}]
["F","NORD","PIC",6,377089,"THIERRY","Charlotte",2003,25.12,"La Ferté Milon CMHM","F",10,12,14,26,15,17,19,36,62,211.260152547681,36.879999999999995,null,{"$f":"IF(A11=\"F\",(IF(OR(H11>2001,H11<2004),VLOOKUP(I11,Feuil1!$G$11:$H$25,2))),IF(A11=\"H\",(IF(OR(H11>2001,H11<2004),VLOOKUP(I11,Feuil1!$A$11:$F$29,2)))))","v":"FM36"},null,{"$f":"T11-HLOOKUP(X11,#REF!,2,FALSE)","v":{"$error":"#REF!"}},{"$f":"T11-HLOOKUP(X11,#REF!,3,FALSE)","v":{"$error":"#REF!"}},{"$f":"T11-HLOOKUP(X11,#REF!,4,FALSE)","v":{"$error":"#REF!"}},{"$f":"T11-HLOOKUP(X11,#REF!,5,FALSE)","v":{"$error":"#REF!"}},{"$f":"T11-HLOOKUP(X11,#REF!,6,FALSE)","v":{"$error":"#REF!"}},{"$f":"T11-HLOOKUP(X11,#REF!,7,FALSE)","v":{"$error":"#REF!"}},{"$f":"T11-HLOOKUP(X11,#REF!,8,FALSE)","v":{"$error":"#REF!"}},{"$f":"T11-HLOOKUP(X11,#REF!,9,FALSE)","v":{"$error":"#REF!"}},null,null,null,null,null,null,null,{"$error":"#REF!"}]
["F","NE","LOR",7,282113,"LEYSER","Aline",2003,39.299999999999997,"H.VALLEROY-AUBOUÉ","F",-13,13,14,27,16,17,18,35,62,123.03392799072296,22.700000000000003,null,{"$f":"IF(A12=\"F\",(IF(OR(H12>2001,H12<2004),VLOOKUP(I12,Feuil1!$G$11:$H$25,2))),IF(A12=\"H\",(IF(OR(H12>2001,H12<2004),VLOOKUP(I12,Feuil1!$A$11:$F$29,2)))))","v":"FM40"},null,{"$f":"T12-HLOOKUP(X12,#REF!,2,FALSE)","v":{"$error":"#REF!"}},{"$f":"T12-HLOOKUP(X12,#REF!,3,FALSE)","v":{"$error":"#REF!"}},{"$f":"T12-HLOOKUP(X12,#REF!,4,FALSE)","v":{"$error":"#REF!"}},{"$f":"T12-HLOOKUP(X12,#REF!,5,FALSE)","v":{"$error":"#REF!"}},{"$f":"T12-HLOOKUP(X12,#REF!,6,FALSE)","v":{"$error":"#REF!"}},{"$f":"T12-HLOOKUP(X12,#REF!,7,FALSE)","v":{"$error":"#REF!"}},{"$f":"T12-HLOOKUP(X12,#REF!,8,FALSE)","v":{"$error":"#REF!"}},{"$f":"T12-HLOOKUP(X12,#REF!,9,FALSE)","v":{"$error":"#REF!"}},null,null,null,null,null,null,null,{"$error":"#REF!"}]
["F","SEST","CAZ",8,395059,"HELOU","Sasha",2002,35.9,"ES VILLENEUVE LOUBET","F",9,10,11,21,14,16,18,34,55,120.2258845358579,19.100000000000001,null,{"$f":"IF(A13=\"F\",(IF(OR(H13>2001,H13<2004),VLOOKUP(I13,Feuil1!$G$11:$H$25,2))),IF(A13=\"H\",(IF(OR(H13>2001,H13<2004),VLOOKUP(I13,Feuil1!$A$11:$F$29,2)))))","v":"FM36"},null,{"$f":"T13-HLOOKUP(X13,#REF!,2,FALSE)","v":{"$error":"#REF!"}},{"$f":"T13-HLOOKUP(X13,#REF!,3,FALSE)","v":{"$error":"#REF!"}},{"$f":"T13-HLOOKUP(X13,#REF!,4,FALSE)","v":{"$error":"#REF!"}},{"$f":"T13-HLOOKUP(X13,#REF!,5,FALSE)","v":{"$error":"#REF!"}},{"$f":"T13-HLOOKUP(X13,#REF!,6,FALSE)","v":{"$error":"#REF!"}},{"$f":"T13-HLOOKUP(X13,#REF!,7,FALSE)","v":{"$error":"#REF!"}},{"$f":"T13-HLOOKUP(X13,#REF!,8,FALSE)","v":{"$error":"#REF!"}},{"$f":"T13-HLOOKUP(X13,#REF!,9,FALSE)","v":{"$error":"#REF!"}},null,null,null,null,null,null,null,{"$error":"#REF!"}]
["F","CO","PDL",9,388363,"RENOIR","Anaïs",2003,39.6,"CJF LAVAL - VOUTRÉ","F",12,-14,14,26,13,14,-15,27,53,104.35311777024165,13.399999999999999,null,{"$f":"IF(A14=\"F\",(IF(OR(H14>2001,H14<2004),VLOOKUP(I14,Feuil1!$G$11:$H$25,2))),IF(A14=\"H\",(IF(OR(H14>2001,H14<2004),VLOOKUP(I14,Feuil1!$A$11:$F$29,2)))))","v":"FM40"},null,{"$f":"T14-HLOOKUP(X14,#REF!,2,FALSE)","v":{"$error":"#REF!"}},{"$f":"T14-HLOOKUP(X14,#REF!,3,FALSE)","v":{"$error":"#REF!"}},{"$f":"T14-HLOOKUP(X14,#REF!,4,FALSE)","v":{"$error":"#REF!"}},{"$f":"T14-HLOOKUP(X14,#REF!,5,FALSE)","v":{"$error":"#REF!"}},{"$f":"T14-HLOOKUP(X14,#REF!,6,FALSE)","v":{"$error":"#REF!"}},{"$f":"T14-HLOOKUP(X14,#REF!,7,FALSE)","v":{"$error":"#REF!"}},{"$f":"T14-HLOOKUP(X14,#REF!,8,FALSE)","v":{"$error":"#REF!"}},{"$f":"T14-HLOOKUP(X14,#REF!,9,FALSE)","v":{"$error":"#REF!"}},null,null,null,null,null,null,null,{"$error":"#REF!"}]
[null,null,null,null,null,null,null,null,null,null,null,null,null,null,null,null,null,null,null,null,null,null,null,null,null,null," ",{"$f":"T15-HLOOKUP(X15,[1]Feuil1!$C$1:$BL$10,2,FALSE)","v":{"$error":"#N/A"}},{"$f":"T15-HLOOKUP(X15,[1]Feuil1!$C$1:$BL$10,3,FALSE)","v":{"$error":"#N/A"}},{"$f":"T15-HLOOKUP(X15,[1]Feuil1!$C$1:$BL$10,4,FALSE)","v":{"$error":"#N/A"}},{"$f":"T15-HLOOKUP(X15,[1]Feuil1!$C$1:$BL$10,5,FALSE)","v":{"$error":"#N/A"}},{"$f":"T15-HLOOKUP(X15,[1]Feuil1!$C$1:$BL$10,6,FALSE)","v":{"$error":"#N/A"}},{"$f":"T15-HLOOKUP(X15,[1]Feuil1!$C$1:$BL$10,7,FALSE)","v":{"$error":"#N/A"}},{"$f":"T15-HLOOKUP(X15,[1]Feuil1!$C$1:$BL$10,8,FALSE)","v":{"$error":"#N/A"}},{"$f":"T15-HLOOKUP(X15,[1]Feuil1!$C$1:$BL$10,9,FALSE)","v":{"$error":"#N/A"}},{"$f":"T15-HLOOKUP(X15,[1]Feuil1!$C$1:$BL$10,10,FALSE)","v":{"$error":"#N/A"}},null,null,null,null,null,null,{"$f":"IF(AJ15>=0,$AJ$4,IF(AI15>=0,$AI$4,IF(AH15>=0,$AH$4,IF(AG15>=0,$AG$4,IF(AF15>=0,$AF$4,IF(AE15>=0,$AE$4,IF(AD15>=0,$AD$4,IF(AC15>=0,$AC$4,$AB$4))))))))","v":{"$error":"#N/A"}}]
{"$rows_left_out":547}
{"sheet":"MINIMES GARCONS","index":1,"n_rows":672,"n_cols":48,"rows_kept":672,"cut":false,"hidden":false,"merged":[[0,6,0,14],[0,18,0,21],[1,5,1,10],[1,11,1,13],[1,14,1,17],[1,18,1,19],[1,21,1,22]]}
[null,null,null,"LISTING NATIONAL",null,null,"MINIMES GARCONS",null,null,null,null,null,null,null,null,null,"DATE :",null,"2015-06-30"]
[null,null,null," ",null,"2014-2015",null,null,null,null,null,"3° TRIMESTRE"]
[]
["SEXE","ZONE","REG.","Place","LICENCE","NOMS","Prénoms","AN","POIDS","CLUB","NAT",1,2,3,"ARR",1,2,3,"EP-J","TOTAL","IWF","Points",null,"Catég"," ","DEP +","REG +","IRG +","FED +","NAT +","INTB +","INTA +","OLY +","NCL"]
[null,null,null,null,null,null,null,null,null,null,null,null,null,null,null,null,null,null,null,null,null,null,null,null,null,null," ",{"$f":"T5-HLOOKUP(X5,[1]Feuil1!$C$1:$BL$10,2,FALSE)","v":{"$error":"#N/A"}},{"$f":"T5-HLOOKUP(X5,[1]Feuil1!$C$1:$BL$10,3,FALSE)","v":{"$error":"#N/A"}},{"$f":"T5-HLOOKUP(X5,[1]Feuil1!$C$1:$BL$10,4,FALSE)","v":{"$error":"#N/A"}},{"$f":"T5-HLOOKUP(X5,[1]Feuil1!$C$1:$BL$10,5,FALSE)","v":{"$error":"#N/A"}},{"$f":"T5-HLOOKUP(X5,[1]Feuil1!$C$1:$BL$10,6,FALSE)","v":{"$error":"#N/A"}},{"$f":"T5-HLOOKUP(X5,[1]Feuil1!$C$1:$BL$10,7,FALSE)","v":{"$error":"#N/A"}},{"$f":"T5-HLOOKUP(X5,[1]Feuil1!$C$1:$BL$10,8,FALSE)","v":{"$error":"#N/A"}},{"$f":"T5-HLOOKUP(X5,[1]Feuil1!$C$1:$BL$10,9,FALSE)","v":{"$error":"#N/A"}},{"$f":"T5-HLOOKUP(X5,[1]Feuil1!$C$1:$BL$10,10,FALSE)","v":{"$error":"#N/A"}},null,null,null,null,null,null,{"$f":"IF(AJ5>=0,$AJ$4,IF(AI5>=0,$AI$4,IF(AH5>=0,$AH$4,IF(AG5>=0,$AG$4,IF(AF5>=0,$AF$4,IF(AE5>=0,$AE$4,IF(AD5>=0,$AD$4,IF(AC5>=0,$AC$4,$AB$4))))))))","v":{"$error":"#N/A"}}]
["H","CO","PDL",1,355921,"COGNON","Théo",2002,39.4,"CJF LAVAL - VOUTRÉ","F",38,40,42,{"$f":"IF(MAXA(L6+M6,M6+N6,L6+N6,L6,M6,N6)<=0,0,MAXA(L6+M6,M6+N6,L6+N6,L6,M6,N6))","v":82},48,50,52,{"$f":"IF(MAXA(P6+Q6,Q6+R6,P6+R6,P6,Q6,R6)<=0,0,MAXA(P6+Q6,Q6+R6,P6+R6,P6,Q6,R6))","v":102},{"$f":"IF(H6=\"\",\"\",IF(OR(O6=0,S6=0),0,O6+S6))","v":184},{"$f":"IF(I6=\"\",\"\",IF(A6=\"H\",10^(0.794358141*LOG(I6/174.393)^2)*T6,IF(A6=\"F\",10^(0.89726074 * LOG(I6/148.026)^2)*T6,\"\")))","v":394.77521288907394},{"$f":"SUM(T6-I6)","v":144.6},null,{"$f":"IF(A6=\"F\",(IF(OR(H6>2001,H6<2004),VLOOKUP(I6,Feuil1!$G$11:$H$25,2))),IF(A6=\"H\",(IF(OR(H6>2001,H6<2004),VLOOKUP(I6,Feuil1!$A$11:$F$29,2)))))","v":"M40"},null,{"$f":"T6-HLOOKUP(X6,#REF!,2,FALSE)","v":{"$error":"#REF!"}},{"$f":"T6-HLOOKUP(X6,#REF!,3,FALSE)","v":{"$error":"#REF!"}},{"$f":"T6-HLOOKUP(X6,#REF!,4,FALSE)","v":{"$error":"#REF!"}},{"$f":"T6-HLOOKUP(X6,#REF!,5,FALSE)","v":{"$error":"#REF!"}},{"$f":"T6-HLOOKUP(X6,#REF!,6,FALSE)","v":{"$error":"#REF!"}},{"$f":"T6-HLOOKUP(X6,#REF!,7,FALSE)","v":{"$error":"#REF!"}},{"$f":"T6-HLOOKUP(X6,#REF!,8,FALSE)","v":{"$error":"#REF!"}},{"$f":"T6-HLOOKUP(X6,#REF!,9,FALSE)","v":{"$error":"#REF!"}},null,null,null,null,null,null,null,{"$f":"IF(AG6>=0,$AG$4,IF(AF6>=0,$AF$4,IF(AE6>=0,$AE$4,IF(AD6>=0,$AD$4,IF(AC6>=0,$AC$4,IF(AB6>=0,$AB$4,IF(AA6>=0,$AA$4,IF(Z6>=0,$Z$4,$AH$4))))))))","v":{"$error":"#REF!"}}]
["H","NORD","NPC",2,248952,"BUYSSCHAERT","Tristan",2003,36.299999999999997,"CHCD COMINES","F",29,31,33,64,40,42,44,86,150,350.87894022624391,113.7,null,{"$f":"IF(A7=\"F\",(IF(OR(H7>2001,H7<2004),VLOOKUP(I7,Feuil1!$G$11:$H$25,2))),IF(A7=\"H\",(IF(OR(H7>2001,H7<2004),VLOOKUP(I7,Feuil1!$A$11:$F$29,2)))))","v":"M40"},null,{"$f":"T7-HLOOKUP(X7,#REF!,2,FALSE)","v":{"$error":"#REF!"}},{"$f":"T7-HLOOKUP(X7,#REF!,3,FALSE)","v":{"$error":"#REF!"}},{"$f":"T7-HLOOKUP(X7,#REF!,4,FALSE)","v":{"$error":"#REF!"}},{"$f":"T7-HLOOKUP(X7,#REF!,5,FALSE)","v":{"$error":"#REF!"}},{"$f":"T7-HLOOKUP(X7,#REF!,6,FALSE)","v":{"$error":"#REF!"}},{"$f":"T7-HLOOKUP(X7,#REF!,7,FALSE)","v":{"$error":"#REF!"}},{"$f":"T7-HLOOKUP(X7,#REF!,8,FALSE)","v":{"$error":"#REF!"}},{"$f":"T7-HLOOKUP(X7,#REF!,9,FALSE)","v":{"$error":"#REF!"}},null,null,null,null,null,null,null,{"$error":"#REF!"}]
["H","ZCO","BRE",3,355330,"OLLIVIER","Leny",2003,36.270000000000003,"AL QUIMPER","F",27,28,29,57,39,40,42,82,139,325.43914047192925,102.72999999999999,null,{"$f":"IF(A8=\"F\",(IF(OR(H8>2001,H8<2004),VLOOKUP(I8,Feuil1!$G$11:$H$25,2))),IF(A8=\"H\",(IF(OR(H8>2001,H8<2004),VLOOKUP(I8,Feuil1!$A$11:$F$29,2)))))","v":"M40"},null,{"$f":"T8-HLOOKUP(X8,#REF!,2,FALSE)","v":{"$error":"#REF!"}},{"$f":"T8-HLOOKUP(X8,#REF!,3,FALSE)","v":{"$error":"#REF!"}},{"$f":"T8-HLOOKUP(X8,#REF!,4,FALSE)","v":{"$error":"#REF!"}},{"$f":"T8-HLOOKUP(X8,#REF!,5,FALSE)","v":{"$error":"#REF!"}},{"$f":"T8-HLOOKUP(X8,#REF!,6,FALSE)","v":{"$error":"#REF!"}},{"$f":"T8-HLOOKUP(X8,#REF!,7,FALSE)","v":{"$error":"#REF!"}},{"$f":"T8-HLOOKUP(X8,#REF!,8,FALSE)","v":{"$error":"#REF!"}},{"$f":"T8-HLOOKUP(X8,#REF!,9,FALSE)","v":{"$error":"#REF!"}},null,null,null,null,null,null,null,{"$error":"#REF!"}]
["H","SEST","RAL",4,359944,"CHABERT","Lucas",2003,39.33,"La Ricamarie","F",25,26,28,54,32,34,36,70,124,266.53045895746544,84.67,null,{"$f":"IF(A9=\"F\",(IF(OR(H9>2001,H9<2004),VLOOKUP(I9,Feuil1!$G$11:$H$25,2))),IF(A9=\"H\",(IF(OR(H9>2001,H9<2004),VLOOKUP(I9,Feuil1!$A$11:$F$29,2)))))","v":"M40"},null,{"$f":"T9-HLOOKUP(X9,#REF!,2,FALSE)","v":{"$error":"#REF!"}},{"$f":"T9-HLOOKUP(X9,#REF!,3,FALSE)","v":{"$error":"#REF!"}},{"$f":"T9-HLOOKUP(X9,#REF!,4,FALSE)","v":{"$error":"#REF!"}},{"$f":"T9-HLOOKUP(X9,#REF!,5,FALSE)","v":{"$error":"#REF!"}},{"$f":"T9-HLOOKUP(X9,#REF!,6,FALSE)","v":{"$error":"#REF!"}},{"$f":"T9-HLOOKUP(X9,#REF!,7,FALSE)","v":{"$error":"#REF!"}},{"$f":"T9-HLOOKUP(X9,#REF!,8,FALSE)","v":{"$error":"#REF!"}},{"$f":"T9-HLOOKUP(X9,#REF!,9,FALSE)","v":{"$error":"#REF!"}},null,null,null,null,null,null,null,{"$error":"#REF!"}]
["H","SO","MPY",5,378627,"VALEAN","Andrei",2003,39.9,"FIGEAC HC","R",23,25,27,52,31,33,35,68,120,254.16519033566215,80.099999999999994,null,{"$f":"IF(A10=\"F\",(IF(OR(H10>2001,H10<2004),VLOOKUP(I10,Feuil1!$G$11:$H$25,2))),IF(A10=\"H\",(IF(OR(H10>2001,H10<2004),VLOOKUP(I10,Feuil1!$A$11:$F$29,2)))))","v":"M40"},null,{"$f":"T10-HLOOKUP(X10,#REF!,2,FALSE)","v":{"$error":"#REF!"}},{"$f":"T10-HLOOKUP(X10,#REF!,3,FALSE)","v":{"$error":"#REF!"}},{"$f":"T10-HLOOKUP(X10,#REF!,4,FALSE)","v":{"$error":"#REF!"}},{"$f":"T10-HLOOKUP(X10,#REF!,5,FALSE)","v":{"$error":"#REF!"}},{"$f":"T10-HLOOKUP(X10,#REF!,6,FALSE)","v":{"$error":"#REF!"}},{"$f":"T10-HLOOKUP(X10,#REF!,7,FALSE)","v":{"$error":"#REF!"}},{"$f":"T10-HLOOKUP(X10,#REF!,8,FALSE)","v":{"$error":"#REF!"}},{"$f":"T10-HLOOKUP(X10,#REF!,9,FALSE)","v":{"$error":"#REF!"}},null,null,null,null,null,null,null,{"$error":"#REF!"}]
["H","SEST","RAL",6,373869,"MATHUREL","Lucas",2002,38.71,"CH Saint Baldoph","F",22,24,-26,46,32,34,36,70,116,253.46158430165556,77.289999999999992,null,{"$f":"IF(A11=\"F\",(IF(OR(H11>2001,H11<2004),VLOOKUP(I11,Feuil1!$G$11:$H$25,2))),IF(A11=\"H\",(IF(OR(H11>2001,H11<2004),VLOOKUP(I11,Feuil1!$A$11:$F$29,2)))))","v":"M40"},null,{"$f":"T11-HLOOKUP(X11,#REF!,2,FALSE)","v":{"$error":"#REF!"}},{"$f":"T11-HLOOKUP(X11,#REF!,3,FALSE)","v":{"$error":"#REF!"}},{"$f":"T11-HLOOKUP(X11,#REF!,4,FALSE)","v":{"$error":"#REF!"}},{"$f":"T11-HLOOKUP(X11,#REF!,5,FALSE)","v":{"$error":"#REF!"}},{"$f":"T11-HLOOKUP(X11,#REF!,6,FALSE)","v":{"$error":"#REF!"}},{"$f":"T11-HLOOKUP(X11,#REF!,7,FALSE)","v":{"$error":"#REF!"}},{"$f":"T11-HLOOKUP(X11,#REF!,8,FALSE)","v":{"$error":"#REF!"}},{"$f":"T11-HLOOKUP(X11,#REF!,9,FALSE)","v":{"$error":"#REF!"}},null,null,null,null,null,null,null,{"$error":"#REF!"}]
["H","SEST","PRO",7,320573,"POUBLAN","Thomas",2002,33.17,"EEAR. MONTEUX","F",20,22,24,46,30,32,34,66,112,289.6743796725101,78.83,null,{"$f":"IF(A12=\"F\",(IF(OR(H12>2001,H12<2004),VLOOKUP(I12,Feuil1!$G$11:$H$25,2))),IF(A12=\"H\",(IF(OR(H12>2001,H12<2004),VLOOKUP(I12,Feuil1!$A$11:$F$29,2)))))","v":"M40"},null,{"$f":"T12-HLOOKUP(X12,#REF!,2,FALSE)","v":{"$error":"#REF!"}},{"$f":"T12-HLOOKUP(X12,#REF!,3,FALSE)","v":{"$error":"#REF!"}},{"$f":"T12-HLOOKUP(X12,#REF!,4,FALSE)","v":{"$error":"#REF!"}},{"$f":"T12-HLOOKUP(X12,#REF!,5,FALSE)","v":{"$error":"#REF!"}},{"$f":"T12-HLOOKUP(X12,#REF!,6,FALSE)","v":{"$error":"#REF!"}},{"$f":"T12-HLOOKUP(X12,#REF!,7,FALSE)","v":{"$error":"#REF!"}},{"$f":"T12-HLOOKUP(X12,#REF!,8,FALSE)","v":{"$error":"#REF!"}},{"$f":"T12-HLOOKUP(X12,#REF!,9,FALSE)","v":{"$error":"#REF!"}},null,null,null,null,null,null,null,{"$error":"#REF!"}]
["H","NORD","PIC",8,323797,"MARTIN","Thomas",2002,31.57,"Saleux CHM","F",23,25,26,51,29,30,-32,59,110,301.32676188884471,78.430000000000007,null,{"$f":"IF(A13=\"F\",(IF(OR(H13>2001,H13<2004),VLOOKUP(I13,Feuil1!$G$11:$H$25,2))),IF(A13=\"H\",(IF(OR(H13>2001,H13<2004),VLOOKUP(I13,Feuil1!$A$11:$F$29,2)))))","v":"M40"},null,{"$f":"T13-HLOOKUP(X13,#REF!,2,FALSE)","v":{"$error":"#REF!"}},{"$f":"T13-HLOOKUP(X13,#REF!,3,FALSE)","v":{"$error":"#REF!"}},{"$f":"T13-HLOOKUP(X13,#REF!,4,FALSE)","v":{"$error":"#REF!"}},{"$f":"T13-HLOOKUP(X13,#REF!,5,FALSE)","v":{"$error":"#REF!"}},{"$f":"T13-HLOOKUP(X13,#REF!,6,FALSE)","v":{"$error":"#REF!"}},{"$f":"T13-HLOOKUP(X13,#REF!,7,FALSE)","v":{"$error":"#REF!"}},{"$f":"T13-HLOOKUP(X13,#REF!,8,FALSE)","v":{"$error":"#REF!"}},{"$f":"T13-HLOOKUP(X13,#REF!,9,FALSE)","v":{"$error":"#REF!"}},null,null,null,null,null,null,null,{"$error":"#REF!"}]
["H","SEST","CAZ",9,391434,"MERIAUX ","Tom",2002,38.9,"ES VILLENEUVE LOUBET","F",-20,20,22,42,32,34,-36,66,108,234.78648425716207,69.099999999999994,null,{"$f":"IF(A14=\"F\",(IF(OR(H14>2001,H14<2004),VLOOKUP(I14,Feuil1!$G$11:$H$25,2))),IF(A14=\"H\",(IF(OR(H14>2001,H14<2004),VLOOKUP(I14,Feuil1!$A$11:$F$29,2)))))","v":"M40"},null,{"$f":"T14-HLOOKUP(X14,#REF!,2,FALSE)","v":{"$error":"#REF!"}},{"$f":"T14-HLOOKUP(X14,#REF!,3,FALSE)","v":{"$error":"#REF!"}},{"$f":"T14-HLOOKUP(X14,#REF!,4,FALSE)","v":{"$error":"#REF!"}},{"$f":"T14-HLOOKUP(X14,#REF!,5,FALSE)","v":{"$error":"#REF!"}},{"$f":"T14-HLOOKUP(X14,#REF!,6,FALSE)","v":{"$error":"#REF!"}},{"$f":"T14-HLOOKUP(X14,#REF!,7,FALSE)","v":{"$error":"#REF!"}},{"$f":"T14-HLOOKUP(X14,#REF!,8,FALSE)","v":{"$error":"#REF!"}},{"$f":"T14-HLOOKUP(X14,#REF!,9,FALSE)","v":{"$error":"#REF!"}},null,null,null,null,null,null,null,{"$error":"#REF!"}]
["H","NE","LOR",10,251046,"DUCHAUFFOUR","Lucas",2003,28.26,"H.VALLEROY-AUBOUÉ","F",20,21,22,43,30,31,32,63,106,332.28658724592663,77.739999999999995,null,{"$f":"IF(A15=\"F\",(IF(OR(H15>2001,H15<2004),VLOOKUP(I15,Feuil1!$G$11:$H$25,2))),IF(A15=\"H\",(IF(OR(H15>2001,H15<2004),VLOOKUP(I15,Feuil1!$A$11:$F$29,2)))))","v":"M40"},null,{"$f":"T15-HLOOKUP(X15,#REF!,2,FALSE)","v":{"$error":"#REF!"}},{"$f":"T15-HLOOKUP(X15,#REF!,3,FALSE)","v":{"$error":"#REF!"}},{"$f":"T15-HLOOKUP(X15,#REF!,4,FALSE)","v":{"$error":"#REF!"}},{"$f":"T15-HLOOKUP(X15,#REF!,5,FALSE)","v":{"$error":"#REF!"}},{"$f":"T15-HLOOKUP(X15,#REF!,6,FALSE)","v":{"$error":"#REF!"}},{"$f":"T15-HLOOKUP(X15,#REF!,7,FALSE)","v":{"$error":"#REF!"}},{"$f":"T15-HLOOKUP(X15,#REF!,8,FALSE)","v":{"$error":"#REF!"}},{"$f":"T15-HLOOKUP(X15,#REF!,9,FALSE)","v":{"$error":"#REF!"}},null,null,null,null,null,null,null,{"$error":"#REF!"}]
{"$rows_left_out":658}
{"sheet":"Feuil1","index":2,"n_rows":29,"n_cols":62,"rows_kept":29,"cut":false,"hidden":true,"merged":[]}
[null,null,"FC1 44","FC1 48","FC1 53","FC1 58","FC1 63","FC1 69","FC1 +69","FC2 44","FC2 48","FC2 53","FC2 58","FC2 63","FC2 69","FC2 +69","FJ48","FJ53","FJ58","FJ63","FJ69","FJ75","FJ+75","FS48","FS53","FS58","FS63","FS69","FS75","FS+75","C1 50","C1 56","C1 62","C1 69","C1 77","C1 85","C1 94","C1 +94","C2 50","C2 56","C2 62","C2 69","C2 77","C2 85","C2 94","C2 +94","J56","J62","J69","J77","J85","J94","J105","J+105","S56","S62","S69","S77","S85","S94","S105","S+105"]
[null,"DEBUTANT",25,25,35,40,45,50,60,30,35,45,40,55,60,70,45,55,60,65,70,80,90,55,65,70,75,80,95,100,40,50,75,85,90,100,110,120,45,65,85,95,110,120,125,135,80,90,110,130,145,150,155,165,95,120,130,150,165,170,175,185]
[null,"DEPARTEMENTAL",35,35,45,50,55,60,70,40,45,55,50,65,70,80,55,65,70,75,80,95,100,65,75,80,85,90,105,110,55,70,95,105,110,120,130,140,65,85,105,115,130,140,145,155,100,120,130,150,165,170,175,185,115,135,150,170,185,190,195,205]
[null,"REGIONAL",40,45,55,60,65,70,80,50,55,65,60,75,80,95,65,75,80,85,90,105,110,75,85,90,95,105,115,125,65,85,105,115,130,140,145,155,80,100,120,130,150,160,165,175,115,135,150,170,185,190,195,205,130,150,170,190,205,215,220,225]
[null,"INTERREGIONAL",50,55,65,70,75,80,95,60,65,75,70,85,90,105,75,85,90,95,105,115,125,85,95,100,110,120,130,140,80,100,120,130,150,160,165,175,95,115,135,150,170,180,185,195,130,150,170,190,205,215,220,225,145,170,190,210,225,235,245,250]
[null,"FEDERAL",60,65,75,80,85,90,105,70,75,85,80,95,105,115,85,95,100,110,120,130,140,95,105,115,125,135,145,150,95,115,135,150,170,180,185,195,110,130,150,170,185,200,210,220,145,170,190,210,225,235,245,250,170,190,220,240,250,260,270,280]
[null,"NATIONAL",70,75,85,90,95,105,115,80,85,95,90,110,120,130,95,105,115,125,135,145,150,110,120,130,140,150,160,170,110,130,150,170,185,200,210,220,120,145,170,190,200,220,225,235,170,190,220,240,250,260,270,280,190,210,240,265,280,290,300,310]
[null,"INTERNATIONAL B",80,85,95,100,110,120,130,90,95,105,100,125,135,145,110,120,130,140,150,160,170,125,140,150,160,170,180,190,120,145,170,190,200,220,225,235,135,170,190,210,220,240,250,260,190,210,240,260,280,290,300,310,210,230,260,285,300,310,325,330]
[null,"INTERNATIONAL A",90,95,105,115,125,135,145,100,110,120,115,140,150,160,125,135,150,160,170,180,190,140,160,170,180,190,195,210,135,170,190,210,220,240,250,260,150,190,210,230,250,260,280,280,210,230,250,285,300,310,325,330,225,255,275,305,325,330,345,355]
[null,"OLYMPIQUE",1000,1000,1000,1000,1000,1000,1000,1000,1000,1000,1000,1000,1000,1000,1000,1000,1000,1000,1000,1000,1000,155,175,190,200,205,210,225,1000,1000,1000,1000,1000,10000,1000,1000,1000,1000,1000,1000,1000,10000,1000,1000,1000,1000,1000,10000,1000,1000,1000,10000,240,270,290,320,345,355,365,375]
[null,"MINIME","CADET","CADET","JUNIOR","SENIOR",null,"MINIME","CADETTE","CADETTE","JUNIOR","SENIOR"]
[20.010000000000002,"M40","C1 50","C2 50","J56","S56",20.010000000000002,"FM36","FC1 44","FC2 44","FJ48","FS48"]
[34.01,"M40","C1 50","C2 50","J56","S56",30.01,"FM36","FC1 44","FC2 45","FJ48","FS48"]
[38.01,"M40","C1 50","C2 50","J56","S56",35.01,"FM36","FC1 44","FC2 46","FJ48","FS48"]
[40.01,"M45","C1 50","C2 50","J56","S56",36.01,"FM40","FC1 44","FC2 47","FJ48","FS48"]
{"$rows_left_out":14}