{"text_format":"1","workbook":"xlsx","n_sheets":3,"sheets":["MINIMES FILLES","MINIMES GARCONS","Feuil1"],"not_rendered":{"charts":0,"images":0,"macros":1,"external_links":2,"defined_names":4,"comments":2,"pivot_tables":0},"unopened":[],"bounds":{"document_bytes":16777216,"sheet_cells":100000,"rows_first":2000,"rows_last":500,"rows_between":2000,"halvings":0,"cell_chars":16384,"cell_head_chars":4096},"cells_cut":0,"cells_raw":0,"read":"whole","date_system":"1900"}

{"sheet":"MINIMES FILLES","index":0,"n_rows":561,"n_cols":48,"rows_kept":561,"cut":false,"hidden":false,"merged":[[0,6,0,14],[0,18,0,21],[1,5,1,10],[1,11,1,13],[1,14,1,17],[1,18,1,19],[1,21,1,22]]}
[null,null,null,"LISTING NATIONAL",null,null,"MINIMES FILLES",null,null,null,null,null,null,null,null,null,"DATE :",null,"2015-06-30"]
[null,null,null," ",null,"2014-2015",null,null,null,null,null,"3° TRIMESTRE"]
[]
["SEXE","ZONE","REG.","Place","LICENCE","NOMS","Prénoms","AN","POIDS","CLUB","NAT",1,2,3,"ARR",1,2,3,"EP-J","TOTAL","IWF","Points",null,"Catég"," ","DEP +","REG +","IRG +","FED +","NAT +","INTB +","INTA +","OLY +","NCL"]
[null,null,null,null,null,null,null,null,null,null,null,null,null,null,null,null,null,null,null,null,null,null,null,null,null,null," ",{"$f":"T5-HLOOKUP(X5,[1]Feuil1!$C$1:$BL$10,2,FALSE)","v":{"$error":"#N/A"}},{"$f":"T5-HLOOKUP(X5,[1]Feuil1!$C$1:$BL$10,3,FALSE)","v":{"$error":"#N/A"}},{"$f":"T5-HLOOKUP(X5,[1]Feuil1!$C$1:$BL$10,4,FALSE)","v":{"$error":"#N/A"}},{"$f":"T5-HLOOKUP(X5,[1]Feuil1!$C$1:$BL$10,5,FALSE)","v":{"$error":"#N/A"}},{"$f":"T5-HLOOKUP(X5,[1]Feuil1!$C$1:$BL$10,6,FALSE)","v":{"$error":"#N/A"}},{"$f":"T5-HLOOKUP(X5,[1]Feuil1!$C$1:$BL$10,7,FALSE)","v":{"$error":"#N/A"}},{"$f":"T5-HLOOKUP(X5,[1]Feuil1!$C$1:$BL$10,8,FALSE)","v":{"$error":"#N/A"}},{"$f":"T5-HLOOKUP(X5,[1]Feuil1!$C$1:$BL$10,9,FALSE)","v":{"$error":"#N/A"}},{"$f":"T5-HLOOKUP(X5,[1]Feuil1!$C$1:$BL$10,10,FALSE)","v":{"$error":"#N/A"}},null,null,null,null,null,null,{"$f":"IF(AJ5>=0,$AJ$4,IF(AI5>=0,$AI$4,IF(AH5>=0,$AH$4,IF(AG5>=0,$AG$4,IF(AF5>=0,$AF$4,IF(AE5>=0,$AE$4,IF(AD5>=0,$AD$4,IF(AC5>=0,$AC$4,$AB$4))))))))","v":{"$error":"#N/A"}}]
["F","SEST","RAL",1,352111,"PICOT","Zianne",2003,38,"CH Saint Baldoph","F",20,22,-24,{"$f":"IF(MAXA(L6+M6,M6+N6,L6+N6,L6,M6,N6)<=0,0,MAXA(L6+M6,M6+N6,L6+N6,L6,M6,N6))","v":42},29,31,33,{"$f":"IF(MAXA(P6+Q6,Q6+R6,P6+R6,P6,Q6,R6)<=0,0,MAXA(P6+Q6,Q6+R6,P6+R6,P6,Q6,R6))","v":64},{"$f":"IF(H6=\"\",\"\",IF(OR(O6=0,S6=0),0,O6+S6))","v":106},{"$f":"IF(I6=\"\",\"\",IF(A6=\"H\",10^(0.794358141*LOG(I6/174.393)^2)*T6,IF(A6=\"F\",10^(0.89726074 * LOG(I6/148.026)^2)*T6,\"\")))","v":217.88613387138508},{"$f":"SUM(T6-I6)","v":68},null,{"$f":"IF(A6=\"F\",(IF(OR(H6>2001,H6<2004),VLOOKUP(I6,Feuil1!$G$11:$H$25,2))),IF(A6=\"H\",(IF(OR(H6>2001,H6<2004),VLOOKUP(I6,Feuil1!$A$11:$F$29,2)))))","v":"FM40"},null,{"$f":"T6-HLOOKUP(X6,#REF!,2,FALSE)","v":{"$error":"#REF!"}},{"$f":"T6-HLOOKUP(X6,#REF!,3,FALSE)","v":{"$error":"#REF!"}},{"$f":"T6-HLOOKUP(X6,#REF!,4,FALSE)","v":{"$error":"#REF!"}},{"$f":"T6-HLOOKUP(X6,#REF!,5,FALSE)","v":{"$error":"#REF!"}},{"$f":"T6-HLOOKUP(X6,#REF!,6,FALSE)","v":{"$error":"#REF!"}},{"$f":"T6-HLOOKUP(X6,#REF!,7,FALSE)","v":{"$error":"#REF!"}},{"$f":"T6-HLOOKUP(X6,#REF!,8,FALSE)","v":{"$error":"#REF!"}},{"$f":"T6-HLOOKUP(X6,#REF!,9,FALSE)","v":{"$error":"#REF!"}},null,null,null,null,null,null,null,{"$f":"IF(AG6>=0,$AG$4,IF(AF6>=0,$AF$4,IF(AE6>=0,$AE$4,IF(AD6>=0,$AD$4,IF(AC6>=0,$AC$4,IF(AB6>=0,$AB$4,IF(AA6>=0,$AA$4,IF(Z6>=0,$Z$4,$AH$4))))))))","v":{"$error":"#REF!"}}]
["F","CO","PDL",2,386516,"ABRAHAM","Ines-Sarah",2002,39.799999999999997,"CJF LAVAL - VOUTRÉ","F",22,24,26,50,-26,26,27,53,103,201.75428345010693,63.2,null,{"$f":"IF(A7=\"F\",(IF(OR(H7>2001,H7<2004),VLOOKUP(I7,Feuil1!$G$11:$H$25,2))),IF(A7=\"H\",(IF(OR(H7>2001,H7<2004),VLOOKUP(I7,Feuil1!$A$11:$F$29,2)))))","v":"FM40"},null,{"$f":"T7-HLOOKUP(X7,#REF!,2,FALSE)","v":{"$error":"#REF!"}},{"$f":"T7-HLOOKUP(X7,#REF!,3,FALSE)","v":{"$error":"#REF!"}},{"$f":"T7-HLOOKUP(X7,#REF!,4,FALSE)","v":{"$error":"#REF!"}},{"$f":"T7-HLOOKUP(X7,#REF!,5,FALSE)","v":{"$error":"#REF!"}},{"$f":"T7-HLOOKUP(X7,#REF!,6,FALSE)","v":{"$error":"#REF!"}},{"$f":"T7-HLOOKUP(X7,#REF!,7,FALSE)","v":{"$error":"#REF!"}},{"$f":"T7-HLOOKUP(X7,#REF!,8,FALSE)","v":{"$error":"#REF!"}},{"$f":"T7-HLOOKUP(X7,#REF!,9,FALSE)","v":{"$error":"#REF!"}},null,null,null,null,null,null,null,{"$error":"#REF!"}]
["F","NE","ALS",3,354663,"SCHULTZ","LEANE",2003,38.35,"US Wittenheim","F",17,19,21,40,25,27,29,56,96,195.42919978501948,57.65,null,{"$f":"IF(A8=\"F\",(IF(OR(H8>2001,H8<2004),VLOOKUP(I8,Feuil1!$G$11:$H$25,2))),IF(A8=\"H\",(IF(OR(H8>2001,H8<2004),VLOOKUP(I8,Feuil1!$A$11:$F$29,2)))))","v":"FM40"},null,{"$f":"T8-HLOOKUP(X8,#REF!,2,FALSE)","v":{"$error":"#REF!"}},{"$f":"T8-HLOOKUP(X8,#REF!,3,FALSE)","v":{"$error":"#REF!"}},{"$f":"T8-HLOOKUP(X8,#REF!,4,FALSE)","v":{"$error":"#REF!"}},{"$f":"T8-HLOOKUP(X8,#REF!,5,FALSE)","v":{"$error":"#REF!"}},{"$f":"T8-HLOOKUP(X8,#REF!,6,FALSE)","v":{"$error":"#REF!"}},{"$f":"T8-HLOOKUP(X8,#REF!,7,FALSE)","v":{"$error":"#REF!"}},{"$f":"T8-HLOOKUP(X8,#REF!,8,FALSE)","v":{"$error":"#REF!"}},{"$f":"T8-HLOOKUP(X8,#REF!,9,FALSE)","v":{"$error":"#REF!"}},null,null,null,null,null,null,null,{"$error":"#REF!"}]
["F","NORD","PIC",4,386173,"POTARD","Cindy",2002,32.4,"Péronne AAEEP","F",16,18,19,37,22,24,26,50,87,213.85573148390637,54.6,null,{"$f":"IF(A9=\"F\",(IF(OR(H9>2001,H9<2004),VLOOKUP(I9,Feuil1!$G$11:$H$25,2))),IF(A9=\"H\",(IF(OR(H9>2001,H9<2004),VLOOKUP(I9,Feuil1!$A$11:$F$29,2)))))","v":"FM36"},null,{"$f":"T9-HLOOKUP(X9,#REF!,2,FALSE)","v":{"$error":"#REF!"}},{"$f":"T9-HLOOKUP(X9,#REF!,3,FALSE)","v":{"$error":"#REF!"}},{"$f":"T9-HLOOKUP(X9,#REF!,4,FALSE)","v":{"$error":"#REF!"}},{"$f":"T9-HLOOKUP(X9,#REF!,5,FALSE)","v":{"$error":"#REF!"}},{"$f":"T9-HLOOKUP(X9,#REF!,6,FALSE)","v":{"$error":"#REF!"}},{"$f":"T9-HLOOKUP(X9,#REF!,7,FALSE)","v":{"$error":"#REF!"}},{"$f":"T9-HLOOKUP(X9,#REF!,8,FALSE)","v":{"$error":"#REF!"}},{"$f":"T9-HLOOKUP(X9,#REF!,9,FALSE)","v":{"$error":"#REF!"}},null,null,null,null,null,null,null,{"$error":"#REF!"}]
["F","NORD","PIC",5,391502,"QUIN-PLOYARD","Ludivine",2002,40,"Saleux CHM","F",13,15,-17,28,15,17,19,36,64,124.72148323808392,24,null,{"$f":"IF(A10=\"F\",(IF(OR(H10>2001,H10<2004),VLOOKUP(I10,Feuil1!$G$11:$H$25,2))),IF(A10=\"H\",(IF(OR(H10>2001,H10<2004),VLOOKUP(I10,Feuil1!$A$11:$F$29,2)))))","v":"FM40"},null,{"$f":"T10-HLOOKUP(X10,#REF!,2,FALSE)","v":{"$error":"#REF!"}},{"$f":"T10-HLOOKUP(X10,#REF!,3,FALSE)","v":{"$error":"#REF!"}},{"$f":"T10-HLOOKUP(X10,#REF!,4,FALSE)","v":{"$error":"#REF!"}},{"$f":"T10-HLOOKUP(X10,#REF!,5,FALSE)","v":{"$error":"#REF!"}},{"$f":"T10-HLOOKUP(X10,#REF!,6,FALSE)","v":{"$error":"#REF!"}},{"$f":"T10-HLOOKUP(X10,#REF!,7,FALSE)","v":{"$error":"#REF!"}},{"$f":"T10-HLOOKUP(X10,#REF!,8,FALSE)","v":{"$error":"#REF!"}},{"$f":"T10-HLOOKUP(X10,#REF!,9,FALSE)","v":{"$error":"#REF!"}},null,null,null,null,null,null,null,{"$error":"#REF!"}]
["F","NORD","PIC",6,377089,"THIERRY","Charlotte",2003,25.12,"La Ferté Milon CMHM","F",10,12,14,26,15,17,19,36,62,211.260152547681,36.879999999999995,null,{"$f":"IF(A11=\"F\",(IF(OR(H11>2001,H11<2004),VLOOKUP(I11,Feuil1!$G$11:$H$25,2))),IF(A11=\"H\",(IF(OR(H11>2001,H11<2004),VLOOKUP(I11,Feuil1!$A$11:$F$29,2)))))","v":"FM36"},null,{"$f":"T11-HLOOKUP(X11,#REF!,2,FALSE)","v":{"$error":"#REF!"}},{"$f":"T11-HLOOKUP(X11,#REF!,3,FALSE)","v":{"$error":"#REF!"}},{"$f":"T11-HLOOKUP(X11,#REF!,4,FALSE)","v":{"$error":"#REF!"}},{"$f":"T11-HLOOKUP(X11,#REF!,5,FALSE)","v":{"$error":"#REF!"}},{"$f":"T11-HLOOKUP(X11,#REF!,6,FALSE)","v":{"$error":"#REF!"}},{"$f":"T11-HLOOKUP(X11,#REF!,7,FALSE)","v":{"$error":"#REF!"}},{"$f":"T11-HLOOKUP(X11,#REF!,8,FALSE)","v":{"$error":"#REF!"}},{"$f":"T11-HLOOKUP(X11,#REF!,9,FALSE)","v":{"$error":"#REF!"}},null,null,null,null,null,null,null,{"$error":"#REF!"}]
["F","NE","LOR",7,282113,"LEYSER","Aline",2003,39.299999999999997,"H.VALLEROY-AUBOUÉ","F",-13,13,14,27,16,17,18,35,62,123.03392799072296,22.700000000000003,null,{"$f":"IF(A12=\"F\",(IF(OR(H12>2001,H12<2004),VLOOKUP(I12,Feuil1!$G$11:$H$25,2))),IF(A12=\"H\",(IF(OR(H12>2001,H12<2004),VLOOKUP(I12,Feuil1!$A$11:$F$29,2)))))","v":"FM40"},null,{"$f":"T12-HLOOKUP(X12,#REF!,2,FALSE)","v":{"$error":"#REF!"}},{"$f":"T12-HLOOKUP(X12,#REF!,3,FALSE)","v":{"$error":"#REF!"}},{"$f":"T12-HLOOKUP(X12,#REF!,4,FALSE)","v":{"$error":"#REF!"}},{"$f":"T12-HLOOKUP(X12,#REF!,5,FALSE)","v":{"$error":"#REF!"}},{"$f":"T12-HLOOKUP(X12,#REF!,6,FALSE)","v":{"$error":"#REF!"}},{"$f":"T12-HLOOKUP(X12,#REF!,7,FALSE)","v":{"$error":"#REF!"}},{"$f":"T12-HLOOKUP(X12,#REF!,8,FALSE)","v":{"$error":"#REF!"}},{"$f":"T12-HLOOKUP(X12,#REF!,9,FALSE)","v":{"$error":"#REF!"}},null,null,null,null,null,null,null,{"$error":"#REF!"}]
["F","SEST","CAZ",8,395059,"HELOU","Sasha",2002,35.9,"ES VILLENEUVE LOUBET","F",9,10,11,21,14,16,18,34,55,120.2258845358579,19.100000000000001,null,{"$f":"IF(A13=\"F\",(IF(OR(H13>2001,H13<2004),VLOOKUP(I13,Feuil1!$G$11:$H$25,2))),IF(A13=\"H\",(IF(OR(H13>2001,H13<2004),VLOOKUP(I13,Feuil1!$A$11:$F$29,2)))))","v":"FM36"},null,{"$f":"T13-HLOOKUP(X13,#REF!,2,FALSE)","v":{"$error":"#REF!"}},{"$f":"T13-HLOOKUP(X13,#REF!,3,FALSE)","v":{"$error":"#REF!"}},{"$f":"T13-HLOOKUP(X13,#REF!,4,FALSE)","v":{"$error":"#REF!"}},{"$f":"T13-HLOOKUP(X13,#REF!,5,FALSE)","v":{"$error":"#REF!"}},{"$f":"T13-HLOOKUP(X13,#REF!,6,FALSE)","v":{"$error":"#REF!"}},{"$f":"T13-HLOOKUP(X13,#REF!,7,FALSE)","v":{"$error":"#REF!"}},{"$f":"T13-HLOOKUP(X13,#REF!,8,FALSE)","v":{"$error":"#REF!"}},{"$f":"T13-HLOOKUP(X13,#REF!,9,FALSE)","v":{"$error":"#REF!"}},null,null,null,null,null,null,null,{"$error":"#REF!"}]
["F","CO","PDL",9,388363,"RENOIR","Anaïs",2003,39.6,"CJF LAVAL - VOUTRÉ","F",12,-14,14,26,13,14,-15,27,53,104.35311777024165,13.399999999999999,null,{"$f":"IF(A14=\"F\",(IF(OR(H14>2001,H14<2004),VLOOKUP(I14,Feuil1!$G$11:$H$25,2))),IF(A14=\"H\",(IF(OR(H14>2001,H14<2004),VLOOKUP(I14,Feuil1!$A$11:$F$29,2)))))","v":"FM40"},null,{"$f":"T14-HLOOKUP(X14,#REF!,2,FALSE)","v":{"$error":"#REF!"}},{"$f":"T14-HLOOKUP(X14,#REF!,3,FALSE)","v":{"$error":"#REF!"}},{"$f":"T14-HLOOKUP(X14,#REF!,4,FALSE)","v":{"$error":"#REF!"}},{"$f":"T14-HLOOKUP(X14,#REF!,5,FALSE)","v":{"$error":"#REF!"}},{"$f":"T14-HLOOKUP(X14,#REF!,6,FALSE)","v":{"$error":"#REF!"}},{"$f":"T14-HLOOKUP(X14,#REF!,7,FALSE)","v":{"$error":"#REF!"}},{"$f":"T14-HLOOKUP(X14,#REF!,8,FALSE)","v":{"$error":"#REF!"}},{"$f":"T14-HLOOKUP(X14,#REF!,9,FALSE)","v":{"$error":"#REF!"}},null,null,null,null,null,null,null,{"$error":"#REF!"}]
[null,null,null,null,null,null,null,null,null,null,null,null,null,null,null,null,null,null,null,null,null,null,null,null,null,null," ",{"$f":"T15-HLOOKUP(X15,[1]Feuil1!$C$1:$BL$10,2,FALSE)","v":{"$error":"#N/A"}},{"$f":"T15-HLOOKUP(X15,[1]Feuil1!$C$1:$BL$10,3,FALSE)","v":{"$error":"#N/A"}},{"$f":"T15-HLOOKUP(X15,[1]Feuil1!$C$1:$BL$10,4,FALSE)","v":{"$error":"#N/A"}},{"$f":"T15-HLOOKUP(X15,[1]Feuil1!$C$1:$BL$10,5,FALSE)","v":{"$error":"#N/A"}},{"$f":"T15-HLOOKUP(X15,[1]Feuil1!$C$1:$BL$10,6,FALSE)","v":{"$error":"#N/A"}},{"$f":"T15-HLOOKUP(X15,[1]Feuil1!$C$1:$BL$10,7,FALSE)","v":{"$error":"#N/A"}},{"$f":"T15-HLOOKUP(X15,[1]Feuil1!$C$1:$BL$10,8,FALSE)","v":{"$error":"#N/A"}},{"$f":"T15-HLOOKUP(X15,[1]Feuil1!$C$1:$BL$10,9,FALSE)","v":{"$error":"#N/A"}},{"$f":"T15-HLOOKUP(X15,[1]Feuil1!$C$1:$BL$10,10,FALSE)","v":{"$error":"#N/A"}},null,null,null,null,null,null,{"$f":"IF(AJ15>=0,$AJ$4,IF(AI15>=0,$AI$4,IF(AH15>=0,$AH$4,IF(AG15>=0,$AG$4,IF(AF15>=0,$AF$4,IF(AE15>=0,$AE$4,IF(AD15>=0,$AD$4,IF(AC15>=0,$AC$4,$AB$4))))))))","v":{"$error":"#N/A"}}]
["F","SEST","CAZ",1,384345,"LEBORGNE DE KAOUEL","Marie",2002,43.5,"ES VILLENEUVE LOUBET","F",22,24,26,{"$f":"IF(MAXA(L16+M16,M16+N16,L16+N16,L16,M16,N16)<=0,0,MAXA(L16+M16,M16+N16,L16+N16,L16,M16,N16))","v":50},33,35,-37,{"$f":"IF(MAXA(P16+Q16,Q16+R16,P16+R16,P16,Q16,R16)<=0,0,MAXA(P16+Q16,Q16+R16,P16+R16,P16,Q16,R16))","v":68},{"$f":"IF(H16=\"\",\"\",IF(OR(O16=0,S16=0),0,O16+S16))","v":118},{"$f":"IF(I16=\"\",\"\",IF(A16=\"H\",10^(0.794358141*LOG(I16/174.393)^2)*T16,IF(A16=\"F\",10^(0.89726074 * LOG(I16/148.026)^2)*T16,\"\")))","v":211.68201075704155},{"$f":"SUM(T16-I16)","v":74.5},null,{"$f":"IF(A16=\"F\",(IF(OR(H16>2001,H16<2004),VLOOKUP(I16,Feuil1!$G$11:$H$25,2))),IF(A16=\"H\",(IF(OR(H16>2001,H16<2004),VLOOKUP(I16,Feuil1!$A$11:$F$29,2)))))","v":"FM44"},null,{"$f":"T16-HLOOKUP(X16,#REF!,2,FALSE)","v":{"$error":"#REF!"}},{"$f":"T16-HLOOKUP(X16,#REF!,3,FALSE)","v":{"$error":"#REF!"}},{"$f":"T16-HLOOKUP(X16,#REF!,4,FALSE)","v":{"$error":"#REF!"}},{"$f":"T16-HLOOKUP(X16,#REF!,5,FALSE)","v":{"$error":"#REF!"}},{"$f":"T16-HLOOKUP(X16,#REF!,6,FALSE)","v":{"$error":"#REF!"}},{"$f":"T16-HLOOKUP(X16,#REF!,7,FALSE)","v":{"$error":"#REF!"}},{"$f":"T16-HLOOKUP(X16,#REF!,8,FALSE)","v":{"$error":"#REF!"}},{"$f":"T16-HLOOKUP(X16,#REF!,9,FALSE)","v":{"$error":"#REF!"}},null,null,null,null,null,null,null,{"$f":"IF(AG16>=0,$AG$4,IF(AF16>=0,$AF$4,IF(AE16>=0,$AE$4,IF(AD16>=0,$AD$4,IF(AC16>=0,$AC$4,IF(AB16>=0,$AB$4,IF(AA16>=0,$AA$4,IF(Z16>=0,$Z$4,$AH$4))))))))","v":{"$error":"#REF!"}}]
["F","NE","ALS",2,354663,"SCHULTZ","LEANE",2003,41,"US Wittenheim","F",16,18,20,38,26,28,30,58,96,182.47343712395269,55,null,{"$f":"IF(A17=\"F\",(IF(OR(H17>2001,H17<2004),VLOOKUP(I17,Feuil1!$G$11:$H$25,2))),IF(A17=\"H\",(IF(OR(H17>2001,H17<2004),VLOOKUP(I17,Feuil1!$A$11:$F$29,2)))))","v":"FM44"},null,{"$f":"T17-HLOOKUP(X17,#REF!,2,FALSE)","v":{"$error":"#REF!"}},{"$f":"T17-HLOOKUP(X17,#REF!,3,FALSE)","v":{"$error":"#REF!"}},{"$f":"T17-HLOOKUP(X17,#REF!,4,FALSE)","v":{"$error":"#REF!"}},{"$f":"T17-HLOOKUP(X17,#REF!,5,FALSE)","v":{"$error":"#REF!"}},{"$f":"T17-HLOOKUP(X17,#REF!,6,FALSE)","v":{"$error":"#REF!"}},{"$f":"T17-HLOOKUP(X17,#REF!,7,FALSE)","v":{"$error":"#REF!"}},{"$f":"T17-HLOOKUP(X17,#REF!,8,FALSE)","v":{"$error":"#REF!"}},{"$f":"T17-HLOOKUP(X17,#REF!,9,FALSE)","v":{"$error":"#REF!"}},null,null,null,null,null,null,null,{"$error":"#REF!"}]
["F","NORD","NPC",3,349247,"RIQUIER","Cassandra",2003,44,"CHCD COMINES","F",16,18,20,38,26,28,-30,54,92,163.25809315249666,48,null,{"$f":"IF(A18=\"F\",(IF(OR(H18>2001,H18<2004),VLOOKUP(I18,Feuil1!$G$11:$H$25,2))),IF(A18=\"H\",(IF(OR(H18>2001,H18<2004),VLOOKUP(I18,Feuil1!$A$11:$F$29,2)))))","v":"FM44"},null,{"$f":"T18-HLOOKUP(X18,#REF!,2,FALSE)","v":{"$error":"#REF!"}},{"$f":"T18-HLOOKUP(X18,#REF!,3,FALSE)","v":{"$error":"#REF!"}},{"$f":"T18-HLOOKUP(X18,#REF!,4,FALSE)","v":{"$error":"#REF!"}},{"$f":"T18-HLOOKUP(X18,#REF!,5,FALSE)","v":{"$error":"#REF!"}},{"$f":"T18-HLOOKUP(X18,#REF!,6,FALSE)","v":{"$error":"#REF!"}},{"$f":"T18-HLOOKUP(X18,#REF!,7,FALSE)","v":{"$error":"#REF!"}},{"$f":"T18-HLOOKUP(X18,#REF!,8,FALSE)","v":{"$error":"#REF!"}},{"$f":"T18-HLOOKUP(X18,#REF!,9,FALSE)","v":{"$error":"#REF!"}},null,null,null,null,null,null,null,{"$error":"#REF!"}]
["F","SEST","CAZ",4,360579,"GEFFROY","Lisa",2003,41.32,"ASPTT DRAGUIGNAN","F",16,18,19,37,24,25,null,49,86,162.20297327946528,44.68,null,{"$f":"IF(A19=\"F\",(IF(OR(H19>2001,H19<2004),VLOOKUP(I19,Feuil1!$G$11:$H$25,2))),IF(A19=\"H\",(IF(OR(H19>2001,H19<2004),VLOOKUP(I19,Feuil1!$A$11:$F$29,2)))))","v":"FM44"},null,{"$f":"T19-HLOOKUP(X19,#REF!,2,FALSE)","v":{"$error":"#REF!"}},{"$f":"T19-HLOOKUP(X19,#REF!,3,FALSE)","v":{"$error":"#REF!"}},{"$f":"T19-HLOOKUP(X19,#REF!,4,FALSE)","v":{"$error":"#REF!"}},{"$f":"T19-HLOOKUP(X19,#REF!,5,FALSE)","v":{"$error":"#REF!"}},{"$f":"T19-HLOOKUP(X19,#REF!,6,FALSE)","v":{"$error":"#REF!"}},{"$f":"T19-HLOOKUP(X19,#REF!,7,FALSE)","v":{"$error":"#REF!"}},{"$f":"T19-HLOOKUP(X19,#REF!,8,FALSE)","v":{"$error":"#REF!"}},{"$f":"T19-HLOOKUP(X19,#REF!,9,FALSE)","v":{"$error":"#REF!"}},null,null,null,null,null,null,null,{"$error":"#REF!"}]
["F","NORD","PIC",5,391502,"QUIN-PLOYARD","Ludivine",2002,41.32,"Saleux CHM","F",15,17,-19,32,19,21,23,44,76,143.34216243301583,34.68,null,{"$f":"IF(A20=\"F\",(IF(OR(H20>2001,H20<2004),VLOOKUP(I20,Feuil1!$G$11:$H$25,2))),IF(A20=\"H\",(IF(OR(H20>2001,H20<2004),VLOOKUP(I20,Feuil1!$A$11:$F$29,2)))))","v":"FM44"},null,{"$f":"T20-HLOOKUP(X20,#REF!,2,FALSE)","v":{"$error":"#REF!"}},{"$f":"T20-HLOOKUP(X20,#REF!,3,FALSE)","v":{"$error":"#REF!"}},{"$f":"T20-HLOOKUP(X20,#REF!,4,FALSE)","v":{"$error":"#REF!"}},{"$f":"T20-HLOOKUP(X20,#REF!,5,FALSE)","v":{"$error":"#REF!"}},{"$f":"T20-HLOOKUP(X20,#REF!,6,FALSE)","v":{"$error":"#REF!"}},{"$f":"T20-HLOOKUP(X20,#REF!,7,FALSE)","v":{"$error":"#REF!"}},{"$f":"T20-HLOOKUP(X20,#REF!,8,FALSE)","v":{"$error":"#REF!"}},{"$f":"T20-HLOOKUP(X20,#REF!,9,FALSE)","v":{"$error":"#REF!"}},null,null,null,null,null,null,null,{"$error":"#REF!"}]
["F","SEST","CAZ",6,360581,"MONTILLET","Anais",2003,43.2,"ASPTT DRAGUIGNAN","F",13,15,17,32,20,22,-24,42,74,133.63193917056336,30.799999999999997,null,{"$f":"IF(A21=\"F\",(IF(OR(H21>2001,H21<2004),VLOOKUP(I21,Feuil1!$G$11:$H$25,2))),IF(A21=\"H\",(IF(OR(H21>2001,H21<2004),VLOOKUP(I21,Feuil1!$A$11:$F$29,2)))))","v":"FM44"},null,{"$f":"T21-HLOOKUP(X21,#REF!,2,FALSE)","v":{"$error":"#REF!"}},{"$f":"T21-HLOOKUP(X21,#REF!,3,FALSE)","v":{"$error":"#REF!"}},{"$f":"T21-HLOOKUP(X21,#REF!,4,FALSE)","v":{"$error":"#REF!"}},{"$f":"T21-HLOOKUP(X21,#REF!,5,FALSE)","v":{"$error":"#REF!"}},{"$f":"T21-HLOOKUP(X21,#REF!,6,FALSE)","v":{"$error":"#REF!"}},{"$f":"T21-HLOOKUP(X21,#REF!,7,FALSE)","v":{"$error":"#REF!"}},{"$f":"T21-HLOOKUP(X21,#REF!,8,FALSE)","v":{"$error":"#REF!"}},{"$f":"T21-HLOOKUP(X21,#REF!,9,FALSE)","v":{"$error":"#REF!"}},null,null,null,null,null,null,null,{"$error":"#REF!"}]
["F","NE","ALS",7,373892,"MANNY","ELODIE",2003,43.6,"MJC Ungersheim","F",12,14,16,30,18,20,22,42,72,128.87941649902638,28.4,null,{"$f":"IF(A22=\"F\",(IF(OR(H22>2001,H22<2004),VLOOKUP(I22,Feuil1!$G$11:$H$25,2))),IF(A22=\"H\",(IF(OR(H22>2001,H22<2004),VLOOKUP(I22,Feuil1!$A$11:$F$29,2)))))","v":"FM44"},null,{"$f":"T22-HLOOKUP(X22,#REF!,2,FALSE)","v":{"$error":"#REF!"}},{"$f":"T22-HLOOKUP(X22,#REF!,3,FALSE)","v":{"$error":"#REF!"}},{"$f":"T22-HLOOKUP(X22,#REF!,4,FALSE)","v":{"$error":"#REF!"}},{"$f":"T22-HLOOKUP(X22,#REF!,5,FALSE)","v":{"$error":"#REF!"}},{"$f":"T22-HLOOKUP(X22,#REF!,6,FALSE)","v":{"$error":"#REF!"}},{"$f":"T22-HLOOKUP(X22,#REF!,7,FALSE)","v":{"$error":"#REF!"}},{"$f":"T22-HLOOKUP(X22,#REF!,8,FALSE)","v":{"$error":"#REF!"}},{"$f":"T22-HLOOKUP(X22,#REF!,9,FALSE)","v":{"$error":"#REF!"}},null,null,null,null,null,null,null,{"$error":"#REF!"}]
["F","NE","CHA",8,396855,"FERNANDES DA SILVA","Mélinda",2002,40.799999999999997,"Langres HM","F",10,12,-14,22,16,18,20,38,60,114.6063188549887,19.200000000000003,null,{"$f":"IF(A23=\"F\",(IF(OR(H23>2001,H23<2004),VLOOKUP(I23,Feuil1!$G$11:$H$25,2))),IF(A23=\"H\",(IF(OR(H23>2001,H23<2004),VLOOKUP(I23,Feuil1!$A$11:$F$29,2)))))","v":"FM44"},null,{"$f":"T23-HLOOKUP(X23,#REF!,2,FALSE)","v":{"$error":"#REF!"}},{"$f":"T23-HLOOKUP(X23,#REF!,3,FALSE)","v":{"$error":"#REF!"}},{"$f":"T23-HLOOKUP(X23,#REF!,4,FALSE)","v":{"$error":"#REF!"}},{"$f":"T23-HLOOKUP(X23,#REF!,5,FALSE)","v":{"$error":"#REF!"}},{"$f":"T23-HLOOKUP(X23,#REF!,6,FALSE)","v":{"$error":"#REF!"}},{"$f":"T23-HLOOKUP(X23,#REF!,7,FALSE)","v":{"$error":"#REF!"}},{"$f":"T23-HLOOKUP(X23,#REF!,8,FALSE)","v":{"$error":"#REF!"}},{"$f":"T23-HLOOKUP(X23,#REF!,9,FALSE)","v":{"$error":"#REF!"}},null,null,null,null,null,null,null,{"$error":"#REF!"}]
[null,null,null,null,null,null,null,null,null,null,null,null,null,null,null,null,null,null,null,null,null,null,null,null,null,null," ",{"$f":"T24-HLOOKUP(X24,[1]Feuil1!$C$1:$BL$10,2,FALSE)","v":{"$error":"#N/A"}},{"$f":"T24-HLOOKUP(X24,[1]Feuil1!$C$1:$BL$10,3,FALSE)","v":{"$error":"#N/A"}},{"$f":"T24-HLOOKUP(X24,[1]Feuil1!$C$1:$BL$10,4,FALSE)","v":{"$error":"#N/A"}},{"$f":"T24-HLOOKUP(X24,[1]Feuil1!$C$1:$BL$10,5,FALSE)","v":{"$error":"#N/A"}},{"$f":"T24-HLOOKUP(X24,[1]Feuil1!$C$1:$BL$10,6,FALSE)","v":{"$error":"#N/A"}},{"$f":"T24-HLOOKUP(X24,[1]Feuil1!$C$1:$BL$10,7,FALSE)","v":{"$error":"#N/A"}},{"$f":"T24-HLOOKUP(X24,[1]Feuil1!$C$1:$BL$10,8,FALSE)","v":{"$error":"#N/A"}},{"$f":"T24-HLOOKUP(X24,[1]Feuil1!$C$1:$BL$10,9,FALSE)","v":{"$error":"#N/A"}},{"$f":"T24-HLOOKUP(X24,[1]Feuil1!$C$1:$BL$10,10,FALSE)","v":{"$error":"#N/A"}},null,null,null,null,null,null,{"$f":"IF(AJ24>=0,$AJ$4,IF(AI24>=0,$AI$4,IF(AH24>=0,$AH$4,IF(AG24>=0,$AG$4,IF(AF24>=0,$AF$4,IF(AE24>=0,$AE$4,IF(AD24>=0,$AD$4,IF(AC24>=0,$AC$4,$AB$4))))))))","v":{"$error":"#N/A"}}]
["F","SEST","CAZ",1,384345,"LEBORGNE DE KAOUEL","Marie",2002,44.94,"ES VILLENEUVE LOUBET","F",28,30,32,{"$f":"IF(MAXA(L25+M25,M25+N25,L25+N25,L25,M25,N25)<=0,0,MAXA(L25+M25,M25+N25,L25+N25,L25,M25,N25))","v":62},38,40,42,{"$f":"IF(MAXA(P25+Q25,Q25+R25,P25+R25,P25,Q25,R25)<=0,0,MAXA(P25+Q25,Q25+R25,P25+R25,P25,Q25,R25))","v":82},{"$f":"IF(H25=\"\",\"\",IF(OR(O25=0,S25=0),0,O25+S25))","v":144},{"$f":"IF(I25=\"\",\"\",IF(A25=\"H\",10^(0.794358141*LOG(I25/174.393)^2)*T25,IF(A25=\"F\",10^(0.89726074 * LOG(I25/148.026)^2)*T25,\"\")))","v":250.52142900796429},{"$f":"SUM(T25-I25)","v":99.06},null,{"$f":"IF(A25=\"F\",(IF(OR(H25>2001,H25<2004),VLOOKUP(I25,Feuil1!$G$11:$H$25,2))),IF(A25=\"H\",(IF(OR(H25>2001,H25<2004),VLOOKUP(I25,Feuil1!$A$11:$F$29,2)))))","v":"FM48"},null,{"$f":"T25-HLOOKUP(X25,#REF!,2,FALSE)","v":{"$error":"#REF!"}},{"$f":"T25-HLOOKUP(X25,#REF!,3,FALSE)","v":{"$error":"#REF!"}},{"$f":"T25-HLOOKUP(X25,#REF!,4,FALSE)","v":{"$error":"#REF!"}},{"$f":"T25-HLOOKUP(X25,#REF!,5,FALSE)","v":{"$error":"#REF!"}},{"$f":"T25-HLOOKUP(X25,#REF!,6,FALSE)","v":{"$error":"#REF!"}},{"$f":"T25-HLOOKUP(X25,#REF!,7,FALSE)","v":{"$error":"#REF!"}},{"$f":"T25-HLOOKUP(X25,#REF!,8,FALSE)","v":{"$error":"#REF!"}},{"$f":"T25-HLOOKUP(X25,#REF!,9,FALSE)","v":{"$error":"#REF!"}},null,null,null,null,null,null,null,{"$f":"IF(AG25>=0,$AG$4,IF(AF25>=0,$AF$4,IF(AE25>=0,$AE$4,IF(AD25>=0,$AD$4,IF(AC25>=0,$AC$4,IF(AB25>=0,$AB$4,IF(AA25>=0,$AA$4,IF(Z25>=0,$Z$4,$AH$4))))))))","v":{"$error":"#REF!"}}]
["F","NORD","NPC",2,340969,"DESMAREST","Lucie",2002,46.75,"CHCD COMINES","F",26,28,30,58,40,42,-44,82,140,234.93229647857123,93.25,null,{"$f":"IF(A26=\"F\",(IF(OR(H26>2001,H26<2004),VLOOKUP(I26,Feuil1!$G$11:$H$25,2))),IF(A26=\"H\",(IF(OR(H26>2001,H26<2004),VLOOKUP(I26,Feuil1!$A$11:$F$29,2)))))","v":"FM48"},null,{"$f":"T26-HLOOKUP(X26,#REF!,2,FALSE)","v":{"$error":"#REF!"}},{"$f":"T26-HLOOKUP(X26,#REF!,3,FALSE)","v":{"$error":"#REF!"}},{"$f":"T26-HLOOKUP(X26,#REF!,4,FALSE)","v":{"$error":"#REF!"}},{"$f":"T26-HLOOKUP(X26,#REF!,5,FALSE)","v":{"$error":"#REF!"}},{"$f":"T26-HLOOKUP(X26,#REF!,6,FALSE)","v":{"$error":"#REF!"}},{"$f":"T26-HLOOKUP(X26,#REF!,7,FALSE)","v":{"$error":"#REF!"}},{"$f":"T26-HLOOKUP(X26,#REF!,8,FALSE)","v":{"$error":"#REF!"}},{"$f":"T26-HLOOKUP(X26,#REF!,9,FALSE)","v":{"$error":"#REF!"}},null,null,null,null,null,null,null,{"$error":"#REF!"}]
["F","NE","ALS",3,350199,"BAJARD","PERINE",2002,46.5,"Dorlisheim FH","F",22,24,26,50,30,32,-34,62,112,188.85536154965345,65.5,null,{"$f":"IF(A27=\"F\",(IF(OR(H27>2001,H27<2004),VLOOKUP(I27,Feuil1!$G$11:$H$25,2))),IF(A27=\"H\",(IF(OR(H27>2001,H27<2004),VLOOKUP(I27,Feuil1!$A$11:$F$29,2)))))","v":"FM48"},null,{"$f":"T27-HLOOKUP(X27,#REF!,2,FALSE)","v":{"$error":"#REF!"}},{"$f":"T27-HLOOKUP(X27,#REF!,3,FALSE)","v":{"$error":"#REF!"}},{"$f":"T27-HLOOKUP(X27,#REF!,4,FALSE)","v":{"$error":"#REF!"}},{"$f":"T27-HLOOKUP(X27,#REF!,5,FALSE)","v":{"$error":"#REF!"}},{"$f":"T27-HLOOKUP(X27,#REF!,6,FALSE)","v":{"$error":"#REF!"}},{"$f":"T27-HLOOKUP(X27,#REF!,7,FALSE)","v":{"$error":"#REF!"}},{"$f":"T27-HLOOKUP(X27,#REF!,8,FALSE)","v":{"$error":"#REF!"}},{"$f":"T27-HLOOKUP(X27,#REF!,9,FALSE)","v":{"$error":"#REF!"}},null,null,null,null,null,null,null,{"$error":"#REF!"}]
["F","NE","ALS",4,394879,"SCHAEFFER","CHARLIE",2002,47.6,"Dorlisheim FH","F",17,19,21,40,23,25,27,52,92,151.92466201981838,44.4,null,{"$f":"IF(A28=\"F\",(IF(OR(H28>2001,H28<2004),VLOOKUP(I28,Feuil1!$G$11:$H$25,2))),IF(A28=\"H\",(IF(OR(H28>2001,H28<2004),VLOOKUP(I28,Feuil1!$A$11:$F$29,2)))))","v":"FM48"},null,{"$f":"T28-HLOOKUP(X28,#REF!,2,FALSE)","v":{"$error":"#REF!"}},{"$f":"T28-HLOOKUP(X28,#REF!,3,FALSE)","v":{"$error":"#REF!"}},{"$f":"T28-HLOOKUP(X28,#REF!,4,FALSE)","v":{"$error":"#REF!"}},{"$f":"T28-HLOOKUP(X28,#REF!,5,FALSE)","v":{"$error":"#REF!"}},{"$f":"T28-HLOOKUP(X28,#REF!,6,FALSE)","v":{"$error":"#REF!"}},{"$f":"T28-HLOOKUP(X28,#REF!,7,FALSE)","v":{"$error":"#REF!"}},{"$f":"T28-HLOOKUP(X28,#REF!,8,FALSE)","v":{"$error":"#REF!"}},{"$f":"T28-HLOOKUP(X28,#REF!,9,FALSE)","v":{"$error":"#REF!"}},null,null,null,null,null,null,null,{"$error":"#REF!"}]
["F","SEST","PRO",5,391162,"MASTROMAURO","Madison",2002,45.8,"EEAR MONTEUX","F",17,18,19,37,24,25,26,51,88,150.44497712448037,42.2,null,{"$f":"IF(A29=\"F\",(IF(OR(H29>2001,H29<2004),VLOOKUP(I29,Feuil1!$G$11:$H$25,2))),IF(A29=\"H\",(IF(OR(H29>2001,H29<2004),VLOOKUP(I29,Feuil1!$A$11:$F$29,2)))))","v":"FM48"},null,{"$f":"T29-HLOOKUP(X29,#REF!,2,FALSE)","v":{"$error":"#REF!"}},{"$f":"T29-HLOOKUP(X29,#REF!,3,FALSE)","v":{"$error":"#REF!"}},{"$f":"T29-HLOOKUP(X29,#REF!,4,FALSE)","v":{"$error":"#REF!"}},{"$f":"T29-HLOOKUP(X29,#REF!,5,FALSE)","v":{"$error":"#REF!"}},{"$f":"T29-HLOOKUP(X29,#REF!,6,FALSE)","v":{"$error":"#REF!"}},{"$f":"T29-HLOOKUP(X29,#REF!,7,FALSE)","v":{"$error":"#REF!"}},{"$f":"T29-HLOOKUP(X29,#REF!,8,FALSE)","v":{"$error":"#REF!"}},{"$f":"T29-HLOOKUP(X29,#REF!,9,FALSE)","v":{"$error":"#REF!"}},null,null,null,null,null,null,null,{"$error":"#REF!"}]
["F","NORD","PIC",6,378352,"BÉDOT","Manon",2002,46.8,"Villers-Bretonneux KC","F",18,20,-22,38,23,25,-27,48,86,144.17711366591226,39.200000000000003,null,{"$f":"IF(A30=\"F\",(IF(OR(H30>2001,H30<2004),VLOOKUP(I30,Feuil1!$G$11:$H$25,2))),IF(A30=\"H\",(IF(OR(H30>2001,H30<2004),VLOOKUP(I30,Feuil1!$A$11:$F$29,2)))))","v":"FM48"},null,{"$f":"T30-HLOOKUP(X30,#REF!,2,FALSE)","v":{"$error":"#REF!"}},{"$f":"T30-HLOOKUP(X30,#REF!,3,FALSE)","v":{"$error":"#REF!"}},{"$f":"T30-HLOOKUP(X30,#REF!,4,FALSE)","v":{"$error":"#REF!"}},{"$f":"T30-HLOOKUP(X30,#REF!,5,FALSE)","v":{"$error":"#REF!"}},{"$f":"T30-HLOOKUP(X30,#REF!,6,FALSE)","v":{"$error":"#REF!"}},{"$f":"T30-HLOOKUP(X30,#REF!,7,FALSE)","v":{"$error":"#REF!"}},{"$f":"T30-HLOOKUP(X30,#REF!,8,FALSE)","v":{"$error":"#REF!"}},{"$f":"T30-HLOOKUP(X30,#REF!,9,FALSE)","v":{"$error":"#REF!"}},null,null,null,null,null,null,null,{"$error":"#REF!"}]
["F","NE","ALS",7,373892,"MANNY","ELODIE",2003,44.05,"MJC Ungersheim","F",15,17,19,36,22,24,-26,46,82,145.35654935259413,37.950000000000003,null,{"$f":"IF(A31=\"F\",(IF(OR(H31>2001,H31<2004),VLOOKUP(I31,Feuil1!$G$11:$H$25,2))),IF(A31=\"H\",(IF(OR(H31>2001,H31<2004),VLOOKUP(I31,Feuil1!$A$11:$F$29,2)))))","v":"FM48"},null,{"$f":"T31-HLOOKUP(X31,#REF!,2,FALSE)","v":{"$error":"#REF!"}},{"$f":"T31-HLOOKUP(X31,#REF!,3,FALSE)","v":{"$error":"#REF!"}},{"$f":"T31-HLOOKUP(X31,#REF!,4,FALSE)","v":{"$error":"#REF!"}},{"$f":"T31-HLOOKUP(X31,#REF!,5,FALSE)","v":{"$error":"#REF!"}},{"$f":"T31-HLOOKUP(X31,#REF!,6,FALSE)","v":{"$error":"#REF!"}},{"$f":"T31-HLOOKUP(X31,#REF!,7,FALSE)","v":{"$error":"#REF!"}},{"$f":"T31-HLOOKUP(X31,#REF!,8,FALSE)","v":{"$error":"#REF!"}},{"$f":"T31-HLOOKUP(X31,#REF!,9,FALSE)","v":{"$error":"#REF!"}},null,null,null,null,null,null,null,{"$error":"#REF!"}]
["F","NORD","PIC",8,386143,"ETÉVÉ","Axelle",2003,46.41,"Péronne AAEEP","F",16,17,18,35,22,24,-26,46,81,136.82209865019522,34.590000000000003,null,{"$f":"IF(A32=\"F\",(IF(OR(H32>2001,H32<2004),VLOOKUP(I32,Feuil1!$G$11:$H$25,2))),IF(A32=\"H\",(IF(OR(H32>2001,H32<2004),VLOOKUP(I32,Feuil1!$A$11:$F$29,2)))))","v":"FM48"},null,{"$f":"T32-HLOOKUP(X32,#REF!,2,FALSE)","v":{"$error":"#REF!"}},{"$f":"T32-HLOOKUP(X32,#REF!,3,FALSE)","v":{"$error":"#REF!"}},{"$f":"T32-HLOOKUP(X32,#REF!,4,FALSE)","v":{"$error":"#REF!"}},{"$f":"T32-HLOOKUP(X32,#REF!,5,FALSE)","v":{"$error":"#REF!"}},{"$f":"T32-HLOOKUP(X32,#REF!,6,FALSE)","v":{"$error":"#REF!"}},{"$f":"T32-HLOOKUP(X32,#REF!,7,FALSE)","v":{"$error":"#REF!"}},{"$f":"T32-HLOOKUP(X32,#REF!,8,FALSE)","v":{"$error":"#REF!"}},{"$f":"T32-HLOOKUP(X32,#REF!,9,FALSE)","v":{"$error":"#REF!"}},null,null,null,null,null,null,null,{"$error":"#REF!"}]
["F","NORD","PIC",9,386138,"ETÉVÉ","Solène",2003,47.42,"Péronne AAEEP","F",16,17,18,35,22,24,-26,46,81,134.20935589412903,33.58,null,{"$f":"IF(A33=\"F\",(IF(OR(H33>2001,H33<2004),VLOOKUP(I33,Feuil1!$G$11:$H$25,2))),IF(A33=\"H\",(IF(OR(H33>2001,H33<2004),VLOOKUP(I33,Feuil1!$A$11:$F$29,2)))))","v":"FM48"},null,{"$f":"T33-HLOOKUP(X33,#REF!,2,FALSE)","v":{"$error":"#REF!"}},{"$f":"T33-HLOOKUP(X33,#REF!,3,FALSE)","v":{"$error":"#REF!"}},{"$f":"T33-HLOOKUP(X33,#REF!,4,FALSE)","v":{"$error":"#REF!"}},{"$f":"T33-HLOOKUP(X33,#REF!,5,FALSE)","v":{"$error":"#REF!"}},{"$f":"T33-HLOOKUP(X33,#REF!,6,FALSE)","v":{"$error":"#REF!"}},{"$f":"T33-HLOOKUP(X33,#REF!,7,FALSE)","v":{"$error":"#REF!"}},{"$f":"T33-HLOOKUP(X33,#REF!,8,FALSE)","v":{"$error":"#REF!"}},{"$f":"T33-HLOOKUP(X33,#REF!,9,FALSE)","v":{"$error":"#REF!"}},null,null,null,null,null,null,null,{"$error":"#REF!"}]
[null,null,null,null,null,null,null,null,null,null,null,null,null,null,null,null,null,null,null,null,null,null,null,null,null,null," ",{"$f":"T34-HLOOKUP(X34,[1]Feuil1!$C$1:$BL$10,2,FALSE)","v":{"$error":"#N/A"}},{"$f":"T34-HLOOKUP(X34,[1]Feuil1!$C$1:$BL$10,3,FALSE)","v":{"$error":"#N/A"}},{"$f":"T34-HLOOKUP(X34,[1]Feuil1!$C$1:$BL$10,4,FALSE)","v":{"$error":"#N/A"}},{"$f":"T34-HLOOKUP(X34,[1]Feuil1!$C$1:$BL$10,5,FALSE)","v":{"$error":"#N/A"}},{"$f":"T34-HLOOKUP(X34,[1]Feuil1!$C$1:$BL$10,6,FALSE)","v":{"$error":"#N/A"}},{"$f":"T34-HLOOKUP(X34,[1]Feuil1!$C$1:$BL$10,7,FALSE)","v":{"$error":"#N/A"}},{"$f":"T34-HLOOKUP(X34,[1]Feuil1!$C$1:$BL$10,8,FALSE)","v":{"$error":"#N/A"}},{"$f":"T34-HLOOKUP(X34,[1]Feuil1!$C$1:$BL$10,9,FALSE)","v":{"$error":"#N/A"}},{"$f":"T34-HLOOKUP(X34,[1]Feuil1!$C$1:$BL$10,10,FALSE)","v":{"$error":"#N/A"}},null,null,null,null,null,null,{"$f":"IF(AJ34>=0,$AJ$4,IF(AI34>=0,$AI$4,IF(AH34>=0,$AH$4,IF(AG34>=0,$AG$4,IF(AF34>=0,$AF$4,IF(AE34>=0,$AE$4,IF(AD34>=0,$AD$4,IF(AC34>=0,$AC$4,$AB$4))))))))","v":{"$error":"#N/A"}}]
["F","SEST","RAL",1,352110,"PICOT","Zéline",2003,53,"CH Saint Baldoph","F",36,38,40,{"$f":"IF(MAXA(L35+M35,M35+N35,L35+N35,L35,M35,N35)<=0,0,MAXA(L35+M35,M35+N35,L35+N35,L35,M35,N35))","v":78},46,-48,48,{"$f":"IF(MAXA(P35+Q35,Q35+R35,P35+R35,P35,Q35,R35)<=0,0,MAXA(P35+Q35,Q35+R35,P35+R35,P35,Q35,R35))","v":94},{"$f":"IF(H35=\"\",\"\",IF(OR(O35=0,S35=0),0,O35+S35))","v":172},{"$f":"IF(I35=\"\",\"\",IF(A35=\"H\",10^(0.794358141*LOG(I35/174.393)^2)*T35,IF(A35=\"F\",10^(0.89726074 * LOG(I35/148.026)^2)*T35,\"\")))","v":259.45240284266697},{"$f":"SUM(T35-I35)","v":119},null,{"$f":"IF(A35=\"F\",(IF(OR(H35>2001,H35<2004),VLOOKUP(I35,Feuil1!$G$11:$H$25,2))),IF(A35=\"H\",(IF(OR(H35>2001,H35<2004),VLOOKUP(I35,Feuil1!$A$11:$F$29,2)))))","v":"FM53"},null,{"$f":"T35-HLOOKUP(X35,#REF!,2,FALSE)","v":{"$error":"#REF!"}},{"$f":"T35-HLOOKUP(X35,#REF!,3,FALSE)","v":{"$error":"#REF!"}},{"$f":"T35-HLOOKUP(X35,#REF!,4,FALSE)","v":{"$error":"#REF!"}},{"$f":"T35-HLOOKUP(X35,#REF!,5,FALSE)","v":{"$error":"#REF!"}},{"$f":"T35-HLOOKUP(X35,#REF!,6,FALSE)","v":{"$error":"#REF!"}},{"$f":"T35-HLOOKUP(X35,#REF!,7,FALSE)","v":{"$error":"#REF!"}},{"$f":"T35-HLOOKUP(X35,#REF!,8,FALSE)","v":{"$error":"#REF!"}},{"$f":"T35-HLOOKUP(X35,#REF!,9,FALSE)","v":{"$error":"#REF!"}},null,null,null,null,null,null,null,{"$f":"IF(AG35>=0,$AG$4,IF(AF35>=0,$AF$4,IF(AE35>=0,$AE$4,IF(AD35>=0,$AD$4,IF(AC35>=0,$AC$4,IF(AB35>=0,$AB$4,IF(AA35>=0,$AA$4,IF(Z35>=0,$Z$4,$AH$4))))))))","v":{"$error":"#REF!"}}]
["F","NE","BOU",2,344068,"COMTE","Coralie",2002,52.09,"HC Avallon","F",32,34,36,70,42,44,46,90,160,244.74888623665422,107.91,null,{"$f":"IF(A36=\"F\",(IF(OR(H36>2001,H36<2004),VLOOKUP(I36,Feuil1!$G$11:$H$25,2))),IF(A36=\"H\",(IF(OR(H36>2001,H36<2004),VLOOKUP(I36,Feuil1!$A$11:$F$29,2)))))","v":"FM53"},null,{"$f":"T36-HLOOKUP(X36,#REF!,2,FALSE)","v":{"$error":"#REF!"}},{"$f":"T36-HLOOKUP(X36,#REF!,3,FALSE)","v":{"$error":"#REF!"}},{"$f":"T36-HLOOKUP(X36,#REF!,4,FALSE)","v":{"$error":"#REF!"}},{"$f":"T36-HLOOKUP(X36,#REF!,5,FALSE)","v":{"$error":"#REF!"}},{"$f":"T36-HLOOKUP(X36,#REF!,6,FALSE)","v":{"$error":"#REF!"}},{"$f":"T36-HLOOKUP(X36,#REF!,7,FALSE)","v":{"$error":"#REF!"}},{"$f":"T36-HLOOKUP(X36,#REF!,8,FALSE)","v":{"$error":"#REF!"}},{"$f":"T36-HLOOKUP(X36,#REF!,9,FALSE)","v":{"$error":"#REF!"}},null,null,null,null,null,null,null,{"$error":"#REF!"}]
["F","NE","ALS",3,350199,"BAJARD","PERINE",2002,49.3,"Dorlisheim FH","F",25,27,29,56,36,38,40,78,134,214.62396576971184,84.7,null,{"$f":"IF(A37=\"F\",(IF(OR(H37>2001,H37<2004),VLOOKUP(I37,Feuil1!$G$11:$H$25,2))),IF(A37=\"H\",(IF(OR(H37>2001,H37<2004),VLOOKUP(I37,Feuil1!$A$11:$F$29,2)))))","v":"FM53"},null,{"$f":"T37-HLOOKUP(X37,#REF!,2,FALSE)","v":{"$error":"#REF!"}},{"$f":"T37-HLOOKUP(X37,#REF!,3,FALSE)","v":{"$error":"#REF!"}},{"$f":"T37-HLOOKUP(X37,#REF!,4,FALSE)","v":{"$error":"#REF!"}},{"$f":"T37-HLOOKUP(X37,#REF!,5,FALSE)","v":{"$error":"#REF!"}},{"$f":"T37-HLOOKUP(X37,#REF!,6,FALSE)","v":{"$error":"#REF!"}},{"$f":"T37-HLOOKUP(X37,#REF!,7,FALSE)","v":{"$error":"#REF!"}},{"$f":"T37-HLOOKUP(X37,#REF!,8,FALSE)","v":{"$error":"#REF!"}},{"$f":"T37-HLOOKUP(X37,#REF!,9,FALSE)","v":{"$error":"#REF!"}},null,null,null,null,null,null,null,{"$error":"#REF!"}]
["F","NE","ALS",4,394879,"SCHAEFFER","CHARLIE",2002,48.45,"Dorlisheim FH","F",21,23,25,48,27,29,31,60,108,175.59833891898174,59.55,null,{"$f":"IF(A38=\"F\",(IF(OR(H38>2001,H38<2004),VLOOKUP(I38,Feuil1!$G$11:$H$25,2))),IF(A38=\"H\",(IF(OR(H38>2001,H38<2004),VLOOKUP(I38,Feuil1!$A$11:$F$29,2)))))","v":"FM53"},null,{"$f":"T38-HLOOKUP(X38,#REF!,2,FALSE)","v":{"$error":"#REF!"}},{"$f":"T38-HLOOKUP(X38,#REF!,3,FALSE)","v":{"$error":"#REF!"}},{"$f":"T38-HLOOKUP(X38,#REF!,4,FALSE)","v":{"$error":"#REF!"}},{"$f":"T38-HLOOKUP(X38,#REF!,5,FALSE)","v":{"$error":"#REF!"}},{"$f":"T38-HLOOKUP(X38,#REF!,6,FALSE)","v":{"$error":"#REF!"}},{"$f":"T38-HLOOKUP(X38,#REF!,7,FALSE)","v":{"$error":"#REF!"}},{"$f":"T38-HLOOKUP(X38,#REF!,8,FALSE)","v":{"$error":"#REF!"}},{"$f":"T38-HLOOKUP(X38,#REF!,9,FALSE)","v":{"$error":"#REF!"}},null,null,null,null,null,null,null,{"$error":"#REF!"}]
["F","NORD","PIC",5,378352,"BÉDOT","Manon",2002,49.41,"Villers-Bretonneux KC","F",22,24,26,50,26,28,30,58,108,172.65081029866337,58.59,null,{"$f":"IF(A39=\"F\",(IF(OR(H39>2001,H39<2004),VLOOKUP(I39,Feuil1!$G$11:$H$25,2))),IF(A39=\"H\",(IF(OR(H39>2001,H39<2004),VLOOKUP(I39,Feuil1!$A$11:$F$29,2)))))","v":"FM53"},null,{"$f":"T39-HLOOKUP(X39,#REF!,2,FALSE)","v":{"$error":"#REF!"}},{"$f":"T39-HLOOKUP(X39,#REF!,3,FALSE)","v":{"$error":"#REF!"}},{"$f":"T39-HLOOKUP(X39,#REF!,4,FALSE)","v":{"$error":"#REF!"}},{"$f":"T39-HLOOKUP(X39,#REF!,5,FALSE)","v":{"$error":"#REF!"}},{"$f":"T39-HLOOKUP(X39,#REF!,6,FALSE)","v":{"$error":"#REF!"}},{"$f":"T39-HLOOKUP(X39,#REF!,7,FALSE)","v":{"$error":"#REF!"}},{"$f":"T39-HLOOKUP(X39,#REF!,8,FALSE)","v":{"$error":"#REF!"}},{"$f":"T39-HLOOKUP(X39,#REF!,9,FALSE)","v":{"$error":"#REF!"}},null,null,null,null,null,null,null,{"$error":"#REF!"}]
["F","NORD","PIC",6,380663,"VAN MALLEGHEM","Charlotte",2002,52.72,"Roisel CHFM","F",18,20,22,42,28,30,32,62,104,157.54651077902071,51.28,null,{"$f":"IF(A40=\"F\",(IF(OR(H40>2001,H40<2004),VLOOKUP(I40,Feuil1!$G$11:$H$25,2))),IF(A40=\"H\",(IF(OR(H40>2001,H40<2004),VLOOKUP(I40,Feuil1!$A$11:$F$29,2)))))","v":"FM53"},null,{"$f":"T40-HLOOKUP(X40,#REF!,2,FALSE)","v":{"$error":"#REF!"}},{"$f":"T40-HLOOKUP(X40,#REF!,3,FALSE)","v":{"$error":"#REF!"}},{"$f":"T40-HLOOKUP(X40,#REF!,4,FALSE)","v":{"$error":"#REF!"}},{"$f":"T40-HLOOKUP(X40,#REF!,5,FALSE)","v":{"$error":"#REF!"}},{"$f":"T40-HLOOKUP(X40,#REF!,6,FALSE)","v":{"$error":"#REF!"}},{"$f":"T40-HLOOKUP(X40,#REF!,7,FALSE)","v":{"$error":"#REF!"}},{"$f":"T40-HLOOKUP(X40,#REF!,8,FALSE)","v":{"$error":"#REF!"}},{"$f":"T40-HLOOKUP(X40,#REF!,9,FALSE)","v":{"$error":"#REF!"}},null,null,null,null,null,null,null,{"$error":"#REF!"}]
["F","NORD","PIC",7,386138,"ETÉVÉ","Solène",2003,48.04,"Péronne AAEEP","F",14,16,-18,30,20,22,24,46,76,124.49015336498246,27.96,null,{"$f":"IF(A41=\"F\",(IF(OR(H41>2001,H41<2004),VLOOKUP(I41,Feuil1!$G$11:$H$25,2))),IF(A41=\"H\",(IF(OR(H41>2001,H41<2004),VLOOKUP(I41,Feuil1!$A$11:$F$29,2)))))","v":"FM53"},null,{"$f":"T41-HLOOKUP(X41,#REF!,2,FALSE)","v":{"$error":"#REF!"}},{"$f":"T41-HLOOKUP(X41,#REF!,3,FALSE)","v":{"$error":"#REF!"}},{"$f":"T41-HLOOKUP(X41,#REF!,4,FALSE)","v":{"$error":"#REF!"}},{"$f":"T41-HLOOKUP(X41,#REF!,5,FALSE)","v":{"$error":"#REF!"}},{"$f":"T41-HLOOKUP(X41,#REF!,6,FALSE)","v":{"$error":"#REF!"}},{"$f":"T41-HLOOKUP(X41,#REF!,7,FALSE)","v":{"$error":"#REF!"}},{"$f":"T41-HLOOKUP(X41,#REF!,8,FALSE)","v":{"$error":"#REF!"}},{"$f":"T41-HLOOKUP(X41,#REF!,9,FALSE)","v":{"$error":"#REF!"}},null,null,null,null,null,null,null,{"$error":"#REF!"}]
["F","SO","MPY",8,378621,"HOUZE","Mandy",2002,51.7,"FIGEAC HC","F",7,8,9,17,12,14,16,30,47,72.337715651590528,-4.7000000000000028,null,{"$f":"IF(A42=\"F\",(IF(OR(H42>2001,H42<2004),VLOOKUP(I42,Feuil1!$G$11:$H$25,2))),IF(A42=\"H\",(IF(OR(H42>2001,H42<2004),VLOOKUP(I42,Feuil1!$A$11:$F$29,2)))))","v":"FM53"},null,{"$f":"T42-HLOOKUP(X42,#REF!,2,FALSE)","v":{"$error":"#REF!"}},{"$f":"T42-HLOOKUP(X42,#REF!,3,FALSE)","v":{"$error":"#REF!"}},{"$f":"T42-HLOOKUP(X42,#REF!,4,FALSE)","v":{"$error":"#REF!"}},{"$f":"T42-HLOOKUP(X42,#REF!,5,FALSE)","v":{"$error":"#REF!"}},{"$f":"T42-HLOOKUP(X42,#REF!,6,FALSE)","v":{"$error":"#REF!"}},{"$f":"T42-HLOOKUP(X42,#REF!,7,FALSE)","v":{"$error":"#REF!"}},{"$f":"T42-HLOOKUP(X42,#REF!,8,FALSE)","v":{"$error":"#REF!"}},{"$f":"T42-HLOOKUP(X42,#REF!,9,FALSE)","v":{"$error":"#REF!"}},null,null,null,null,null,null,null,{"$error":"#REF!"}]
[null,null,null,null,null,null,null,null,null,null,null,null,null,null,null,null,null,null,null,null,null,null,null,null,null,null," ",{"$f":"T43-HLOOKUP(X43,[1]Feuil1!$C$1:$BL$10,2,FALSE)","v":{"$error":"#N/A"}},{"$f":"T43-HLOOKUP(X43,[1]Feuil1!$C$1:$BL$10,3,FALSE)","v":{"$error":"#N/A"}},{"$f":"T43-HLOOKUP(X43,[1]Feuil1!$C$1:$BL$10,4,FALSE)","v":{"$error":"#N/A"}},{"$f":"T43-HLOOKUP(X43,[1]Feuil1!$C$1:$BL$10,5,FALSE)","v":{"$error":"#N/A"}},{"$f":"T43-HLOOKUP(X43,[1]Feuil1!$C$1:$BL$10,6,FALSE)","v":{"$error":"#N/A"}},{"$f":"T43-HLOOKUP(X43,[1]Feuil1!$C$1:$BL$10,7,FALSE)","v":{"$error":"#N/A"}},{"$f":"T43-HLOOKUP(X43,[1]Feuil1!$C$1:$BL$10,8,FALSE)","v":{"$error":"#N/A"}},{"$f":"T43-HLOOKUP(X43,[1]Feuil1!$C$1:$BL$10,9,FALSE)","v":{"$error":"#N/A"}},{"$f":"T43-HLOOKUP(X43,[1]Feuil1!$C$1:$BL$10,10,FALSE)","v":{"$error":"#N/A"}},null,null,null,null,null,null,{"$f":"IF(AJ43>=0,$AJ$4,IF(AI43>=0,$AI$4,IF(AH43>=0,$AH$4,IF(AG43>=0,$AG$4,IF(AF43>=0,$AF$4,IF(AE43>=0,$AE$4,IF(AD43>=0,$AD$4,IF(AC43>=0,$AC$4,$AB$4))))))))","v":{"$error":"#N/A"}}]
["F","SEST","RAL",1,352110,"PICOT","Zéline",2003,53.1,"CH Saint Baldoph","F",32,34,36,{"$f":"IF(MAXA(L44+M44,M44+N44,L44+N44,L44,M44,N44)<=0,0,MAXA(L44+M44,M44+N44,L44+N44,L44,M44,N44))","v":70},46,48,50,{"$f":"IF(MAXA(P44+Q44,Q44+R44,P44+R44,P44,Q44,R44)<=0,0,MAXA(P44+Q44,Q44+R44,P44+R44,P44,Q44,R44))","v":98},{"$f":"IF(H44=\"\",\"\",IF(OR(O44=0,S44=0),0,O44+S44))","v":168},{"$f":"IF(I44=\"\",\"\",IF(A44=\"H\",10^(0.794358141*LOG(I44/174.393)^2)*T44,IF(A44=\"F\",10^(0.89726074 * LOG(I44/148.026)^2)*T44,\"\")))","v":253.03688286670081},{"$f":"SUM(T44-I44)","v":114.9},null,{"$f":"IF(A44=\"F\",(IF(OR(H44>2001,H44<2004),VLOOKUP(I44,Feuil1!$G$11:$H$25,2))),IF(A44=\"H\",(IF(OR(H44>2001,H44<2004),VLOOKUP(I44,Feuil1!$A$11:$F$29,2)))))","v":"FM58"},null,{"$f":"T44-HLOOKUP(X44,#REF!,2,FALSE)","v":{"$error":"#REF!"}},{"$f":"T44-HLOOKUP(X44,#REF!,3,FALSE)","v":{"$error":"#REF!"}},{"$f":"T44-HLOOKUP(X44,#REF!,4,FALSE)","v":{"$error":"#REF!"}},{"$f":"T44-HLOOKUP(X44,#REF!,5,FALSE)","v":{"$error":"#REF!"}},{"$f":"T44-HLOOKUP(X44,#REF!,6,FALSE)","v":{"$error":"#REF!"}},{"$f":"T44-HLOOKUP(X44,#REF!,7,FALSE)","v":{"$error":"#REF!"}},{"$f":"T44-HLOOKUP(X44,#REF!,8,FALSE)","v":{"$error":"#REF!"}},{"$f":"T44-HLOOKUP(X44,#REF!,9,FALSE)","v":{"$error":"#REF!"}},null,null,null,null,null,null,null,{"$f":"IF(AG44>=0,$AG$4,IF(AF44>=0,$AF$4,IF(AE44>=0,$AE$4,IF(AD44>=0,$AD$4,IF(AC44>=0,$AC$4,IF(AB44>=0,$AB$4,IF(AA44>=0,$AA$4,IF(Z44>=0,$Z$4,$AH$4))))))))","v":{"$error":"#REF!"}}]
["F","ZCO","BRE",2,357283,"BEGHAIN","Mayliss",2002,54.32,"AL QUIMPER","F",31,32,34,66,41,42,44,86,152,224.86566223456023,97.68,null,{"$f":"IF(A45=\"F\",(IF(OR(H45>2001,H45<2004),VLOOKUP(I45,Feuil1!$G$11:$H$25,2))),IF(A45=\"H\",(IF(OR(H45>2001,H45<2004),VLOOKUP(I45,Feuil1!$A$11:$F$29,2)))))","v":"FM58"},null,{"$f":"T45-HLOOKUP(X45,#REF!,2,FALSE)","v":{"$error":"#REF!"}},{"$f":"T45-HLOOKUP(X45,#REF!,3,FALSE)","v":{"$error":"#REF!"}},{"$f":"T45-HLOOKUP(X45,#REF!,4,FALSE)","v":{"$error":"#REF!"}},{"$f":"T45-HLOOKUP(X45,#REF!,5,FALSE)","v":{"$error":"#REF!"}},{"$f":"T45-HLOOKUP(X45,#REF!,6,FALSE)","v":{"$error":"#REF!"}},{"$f":"T45-HLOOKUP(X45,#REF!,7,FALSE)","v":{"$error":"#REF!"}},{"$f":"T45-HLOOKUP(X45,#REF!,8,FALSE)","v":{"$error":"#REF!"}},{"$f":"T45-HLOOKUP(X45,#REF!,9,FALSE)","v":{"$error":"#REF!"}},null,null,null,null,null,null,null,{"$error":"#REF!"}]
["F","NORD","NPC",3,390782,"BAUQUEL","Aurélia",2003,58,"C.A.ROSENDAEL","F",22,24,26,{"$f":"IF(MAXA(L46+M46,M46+N46,L46+N46,L46,M46,N46)<=0,0,MAXA(L46+M46,M46+N46,L46+N46,L46,M46,N46))","v":50},31,33,35,{"$f":"IF(MAXA(P46+Q46,Q46+R46,P46+R46,P46,Q46,R46)<=0,0,MAXA(P46+Q46,Q46+R46,P46+R46,P46,Q46,R46))","v":68},{"$f":"IF(H46=\"\",\"\",IF(OR(O46=0,S46=0),0,O46+S46))","v":118},{"$f":"IF(I46=\"\",\"\",IF(A46=\"H\",10^(0.794358141*LOG(I46/174.393)^2)*T46,IF(A46=\"F\",10^(0.89726074 * LOG(I46/148.026)^2)*T46,\"\")))","v":166.12945217533266},{"$f":"SUM(T46-I46)","v":60},null,{"$f":"IF(A46=\"F\",(IF(OR(H46>2001,H46<2004),VLOOKUP(I46,Feuil1!$G$11:$H$25,2))),IF(A46=\"H\",(IF(OR(H46>2001,H46<2004),VLOOKUP(I46,Feuil1!$A$11:$F$29,2)))))","v":"FM58"},null,{"$f":"T46-HLOOKUP(X46,#REF!,2,FALSE)","v":{"$error":"#REF!"}},{"$f":"T46-HLOOKUP(X46,#REF!,3,FALSE)","v":{"$error":"#REF!"}},{"$f":"T46-HLOOKUP(X46,#REF!,4,FALSE)","v":{"$error":"#REF!"}},{"$f":"T46-HLOOKUP(X46,#REF!,5,FALSE)","v":{"$error":"#REF!"}},{"$f":"T46-HLOOKUP(X46,#REF!,6,FALSE)","v":{"$error":"#REF!"}},{"$f":"T46-HLOOKUP(X46,#REF!,7,FALSE)","v":{"$error":"#REF!"}},{"$f":"T46-HLOOKUP(X46,#REF!,8,FALSE)","v":{"$error":"#REF!"}},{"$f":"T46-HLOOKUP(X46,#REF!,9,FALSE)","v":{"$error":"#REF!"}},null,null,null,null,null,null,null,{"$f":"IF(AG46>=0,$AG$4,IF(AF46>=0,$AF$4,IF(AE46>=0,$AE$4,IF(AD46>=0,$AD$4,IF(AC46>=0,$AC$4,IF(AB46>=0,$AB$4,IF(AA46>=0,$AA$4,IF(Z46>=0,$Z$4,$AH$4))))))))","v":{"$error":"#REF!"}}]
["F","SEST","LAN",4,375101,"TORRAYSI","Souhaid",2003,54.6,"Narbonne Haltéro","F",18,20,22,42,28,30,32,62,104,153.24024111553098,49.4,null,{"$f":"IF(A47=\"F\",(IF(OR(H47>2001,H47<2004),VLOOKUP(I47,Feuil1!$G$11:$H$25,2))),IF(A47=\"H\",(IF(OR(H47>2001,H47<2004),VLOOKUP(I47,Feuil1!$A$11:$F$29,2)))))","v":"FM58"},null,{"$f":"T47-HLOOKUP(X47,#REF!,2,FALSE)","v":{"$error":"#REF!"}},{"$f":"T47-HLOOKUP(X47,#REF!,3,FALSE)","v":{"$error":"#REF!"}},{"$f":"T47-HLOOKUP(X47,#REF!,4,FALSE)","v":{"$error":"#REF!"}},{"$f":"T47-HLOOKUP(X47,#REF!,5,FALSE)","v":{"$error":"#REF!"}},{"$f":"T47-HLOOKUP(X47,#REF!,6,FALSE)","v":{"$error":"#REF!"}},{"$f":"T47-HLOOKUP(X47,#REF!,7,FALSE)","v":{"$error":"#REF!"}},{"$f":"T47-HLOOKUP(X47,#REF!,8,FALSE)","v":{"$error":"#REF!"}},{"$f":"T47-HLOOKUP(X47,#REF!,9,FALSE)","v":{"$error":"#REF!"}},null,null,null,null,null,null,null,{"$error":"#REF!"}]
[null,null,null,null,null,null,null,null,null,null,null,null,null,null,null,null,null,null,null,null,null,null,null,null,null,null," ",{"$f":"T48-HLOOKUP(X48,[1]Feuil1!$C$1:$BL$10,2,FALSE)","v":{"$error":"#N/A"}},{"$f":"T48-HLOOKUP(X48,[1]Feuil1!$C$1:$BL$10,3,FALSE)","v":{"$error":"#N/A"}},{"$f":"T48-HLOOKUP(X48,[1]Feuil1!$C$1:$BL$10,4,FALSE)","v":{"$error":"#N/A"}},{"$f":"T48-HLOOKUP(X48,[1]Feuil1!$C$1:$BL$10,5,FALSE)","v":{"$error":"#N/A"}},{"$f":"T48-HLOOKUP(X48,[1]Feuil1!$C$1:$BL$10,6,FALSE)","v":{"$error":"#N/A"}},{"$f":"T48-HLOOKUP(X48,[1]Feuil1!$C$1:$BL$10,7,FALSE)","v":{"$error":"#N/A"}},{"$f":"T48-HLOOKUP(X48,[1]Feuil1!$C$1:$BL$10,8,FALSE)","v":{"$error":"#N/A"}},{"$f":"T48-HLOOKUP(X48,[1]Feuil1!$C$1:$BL$10,9,FALSE)","v":{"$error":"#N/A"}},{"$f":"T48-HLOOKUP(X48,[1]Feuil1!$C$1:$BL$10,10,FALSE)","v":{"$error":"#N/A"}},null,null,null,null,null,null,{"$f":"IF(AJ48>=0,$AJ$4,IF(AI48>=0,$AI$4,IF(AH48>=0,$AH$4,IF(AG48>=0,$AG$4,IF(AF48>=0,$AF$4,IF(AE48>=0,$AE$4,IF(AD48>=0,$AD$4,IF(AC48>=0,$AC$4,$AB$4))))))))","v":{"$error":"#N/A"}}]
["F","N","IDF",1,378747,"REZZAK","AMELLE",2002,62.41,"FRANCONVILLE","F",34,36,37,{"$f":"IF(MAXA(L49+M49,M49+N49,L49+N49,L49,M49,N49)<=0,0,MAXA(L49+M49,M49+N49,L49+N49,L49,M49,N49))","v":73},42,44,46,{"$f":"IF(MAXA(P49+Q49,Q49+R49,P49+R49,P49,Q49,R49)<=0,0,MAXA(P49+Q49,Q49+R49,P49+R49,P49,Q49,R49))","v":90},{"$f":"IF(H49=\"\",\"\",IF(OR(O49=0,S49=0),0,O49+S49))","v":163},{"$f":"IF(I49=\"\",\"\",IF(A49=\"H\",10^(0.794358141*LOG(I49/174.393)^2)*T49,IF(A49=\"F\",10^(0.89726074 * LOG(I49/148.026)^2)*T49,\"\")))","v":217.98233947714039},{"$f":"SUM(T49-I49)","v":100.59},null,{"$f":"IF(A49=\"F\",(IF(OR(H49>2001,H49<2004),VLOOKUP(I49,Feuil1!$G$11:$H$25,2))),IF(A49=\"H\",(IF(OR(H49>2001,H49<2004),VLOOKUP(I49,Feuil1!$A$11:$F$29,2)))))","v":"FM+58"},null,{"$f":"T49-HLOOKUP(X49,#REF!,2,FALSE)","v":{"$error":"#REF!"}},{"$f":"T49-HLOOKUP(X49,#REF!,3,FALSE)","v":{"$error":"#REF!"}},{"$f":"T49-HLOOKUP(X49,#REF!,4,FALSE)","v":{"$error":"#REF!"}},{"$f":"T49-HLOOKUP(X49,#REF!,5,FALSE)","v":{"$error":"#REF!"}},{"$f":"T49-HLOOKUP(X49,#REF!,6,FALSE)","v":{"$error":"#REF!"}},{"$f":"T49-HLOOKUP(X49,#REF!,7,FALSE)","v":{"$error":"#REF!"}},{"$f":"T49-HLOOKUP(X49,#REF!,8,FALSE)","v":{"$error":"#REF!"}},{"$f":"T49-HLOOKUP(X49,#REF!,9,FALSE)","v":{"$error":"#REF!"}},null,null,null,null,null,null,null,{"$f":"IF(AG49>=0,$AG$4,IF(AF49>=0,$AF$4,IF(AE49>=0,$AE$4,IF(AD49>=0,$AD$4,IF(AC49>=0,$AC$4,IF(AB49>=0,$AB$4,IF(AA49>=0,$AA$4,IF(Z49>=0,$Z$4,$AH$4))))))))","v":{"$error":"#REF!"}}]
["F","SEST","PRO",2,361672,"BOURGOIS","Clara",2002,63.61,"ISTRES SPORTS","F",32,33,34,{"$f":"IF(MAXA(L50+M50,M50+N50,L50+N50,L50,M50,N50)<=0,0,MAXA(L50+M50,M50+N50,L50+N50,L50,M50,N50))","v":67},41,43,45,{"$f":"IF(MAXA(P50+Q50,Q50+R50,P50+R50,P50,Q50,R50)<=0,0,MAXA(P50+Q50,Q50+R50,P50+R50,P50,Q50,R50))","v":88},{"$f":"IF(H50=\"\",\"\",IF(OR(O50=0,S50=0),0,O50+S50))","v":155},{"$f":"IF(I50=\"\",\"\",IF(A50=\"H\",10^(0.794358141*LOG(I50/174.393)^2)*T50,IF(A50=\"F\",10^(0.89726074 * LOG(I50/148.026)^2)*T50,\"\")))","v":204.67248719226987},{"$f":"SUM(T50-I50)","v":91.39},null,{"$f":"IF(A50=\"F\",(IF(OR(H50>2001,H50<2004),VLOOKUP(I50,Feuil1!$G$11:$H$25,2))),IF(A50=\"H\",(IF(OR(H50>2001,H50<2004),VLOOKUP(I50,Feuil1!$A$11:$F$29,2)))))","v":"FM+58"},null,{"$f":"T50-HLOOKUP(X50,#REF!,2,FALSE)","v":{"$error":"#REF!"}},{"$f":"T50-HLOOKUP(X50,#REF!,3,FALSE)","v":{"$error":"#REF!"}},{"$f":"T50-HLOOKUP(X50,#REF!,4,FALSE)","v":{"$error":"#REF!"}},{"$f":"T50-HLOOKUP(X50,#REF!,5,FALSE)","v":{"$error":"#REF!"}},{"$f":"T50-HLOOKUP(X50,#REF!,6,FALSE)","v":{"$error":"#REF!"}},{"$f":"T50-HLOOKUP(X50,#REF!,7,FALSE)","v":{"$error":"#REF!"}},{"$f":"T50-HLOOKUP(X50,#REF!,8,FALSE)","v":{"$error":"#REF!"}},{"$f":"T50-HLOOKUP(X50,#REF!,9,FALSE)","v":{"$error":"#REF!"}},null,null,null,null,null,null,null,{"$f":"IF(AG50>=0,$AG$4,IF(AF50>=0,$AF$4,IF(AE50>=0,$AE$4,IF(AD50>=0,$AD$4,IF(AC50>=0,$AC$4,IF(AB50>=0,$AB$4,IF(AA50>=0,$AA$4,IF(Z50>=0,$Z$4,$AH$4))))))))","v":{"$error":"#REF!"}}]
["F","ZCO","BRE",3,387354,"ABREUVEUX","Méline",2002,58.3,"ES Saint-Avé","F",17,-18,18,{"$f":"IF(MAXA(L51+M51,M51+N51,L51+N51,L51,M51,N51)<=0,0,MAXA(L51+M51,M51+N51,L51+N51,L51,M51,N51))","v":35},24,25,27,{"$f":"IF(MAXA(P51+Q51,Q51+R51,P51+R51,P51,Q51,R51)<=0,0,MAXA(P51+Q51,Q51+R51,P51+R51,P51,Q51,R51))","v":52},{"$f":"IF(H51=\"\",\"\",IF(OR(O51=0,S51=0),0,O51+S51))","v":87},{"$f":"IF(I51=\"\",\"\",IF(A51=\"H\",10^(0.794358141*LOG(I51/174.393)^2)*T51,IF(A51=\"F\",10^(0.89726074 * LOG(I51/148.026)^2)*T51,\"\")))","v":122.02598028776661},{"$f":"SUM(T51-I51)","v":28.700000000000003},null,{"$f":"IF(A51=\"F\",(IF(OR(H51>2001,H51<2004),VLOOKUP(I51,Feuil1!$G$11:$H$25,2))),IF(A51=\"H\",(IF(OR(H51>2001,H51<2004),VLOOKUP(I51,Feuil1!$A$11:$F$29,2)))))","v":"FM+58"},null,{"$f":"T51-HLOOKUP(X51,#REF!,2,FALSE)","v":{"$error":"#REF!"}},{"$f":"T51-HLOOKUP(X51,#REF!,3,FALSE)","v":{"$error":"#REF!"}},{"$f":"T51-HLOOKUP(X51,#REF!,4,FALSE)","v":{"$error":"#REF!"}},{"$f":"T51-HLOOKUP(X51,#REF!,5,FALSE)","v":{"$error":"#REF!"}},{"$f":"T51-HLOOKUP(X51,#REF!,6,FALSE)","v":{"$error":"#REF!"}},{"$f":"T51-HLOOKUP(X51,#REF!,7,FALSE)","v":{"$error":"#REF!"}},{"$f":"T51-HLOOKUP(X51,#REF!,8,FALSE)","v":{"$error":"#REF!"}},{"$f":"T51-HLOOKUP(X51,#REF!,9,FALSE)","v":{"$error":"#REF!"}},null,null,null,null,null,null,null,{"$f":"IF(AG51>=0,$AG$4,IF(AF51>=0,$AF$4,IF(AE51>=0,$AE$4,IF(AD51>=0,$AD$4,IF(AC51>=0,$AC$4,IF(AB51>=0,$AB$4,IF(AA51>=0,$AA$4,IF(Z51>=0,$Z$4,$AH$4))))))))","v":{"$error":"#REF!"}}]
["F","CO","HNO",4,361094,"GALHAUT ","Lucie",2003,73.099999999999994,"CHM Le Trait","F",12,14,16,{"$f":"IF(MAXA(L52+M52,M52+N52,L52+N52,L52,M52,N52)<=0,0,MAXA(L52+M52,M52+N52,L52+N52,L52,M52,N52))","v":30},20,22,24,{"$f":"IF(MAXA(P52+Q52,Q52+R52,P52+R52,P52,Q52,R52)<=0,0,MAXA(P52+Q52,Q52+R52,P52+R52,P52,Q52,R52))","v":46},{"$f":"IF(H52=\"\",\"\",IF(OR(O52=0,S52=0),0,O52+S52))","v":76},{"$f":"IF(I52=\"\",\"\",IF(A52=\"H\",10^(0.794358141*LOG(I52/174.393)^2)*T52,IF(A52=\"F\",10^(0.89726074 * LOG(I52/148.026)^2)*T52,\"\")))","v":92.270024031967239},{"$f":"SUM(T52-I52)","v":2.9000000000000057},null,{"$f":"IF(A52=\"F\",(IF(OR(H52>2001,H52<2004),VLOOKUP(I52,Feuil1!$G$11:$H$25,2))),IF(A52=\"H\",(IF(OR(H52>2001,H52<2004),VLOOKUP(I52,Feuil1!$A$11:$F$29,2)))))","v":"FM+58"},null,{"$f":"T52-HLOOKUP(X52,#REF!,2,FALSE)","v":{"$error":"#REF!"}},{"$f":"T52-HLOOKUP(X52,#REF!,3,FALSE)","v":{"$error":"#REF!"}},{"$f":"T52-HLOOKUP(X52,#REF!,4,FALSE)","v":{"$error":"#REF!"}},{"$f":"T52-HLOOKUP(X52,#REF!,5,FALSE)","v":{"$error":"#REF!"}},{"$f":"T52-HLOOKUP(X52,#REF!,6,FALSE)","v":{"$error":"#REF!"}},{"$f":"T52-HLOOKUP(X52,#REF!,7,FALSE)","v":{"$error":"#REF!"}},{"$f":"T52-HLOOKUP(X52,#REF!,8,FALSE)","v":{"$error":"#REF!"}},{"$f":"T52-HLOOKUP(X52,#REF!,9,FALSE)","v":{"$error":"#REF!"}},null,null,null,null,null,null,null,{"$f":"IF(AG52>=0,$AG$4,IF(AF52>=0,$AF$4,IF(AE52>=0,$AE$4,IF(AD52>=0,$AD$4,IF(AC52>=0,$AC$4,IF(AB52>=0,$AB$4,IF(AA52>=0,$AA$4,IF(Z52>=0,$Z$4,$AH$4))))))))","v":{"$error":"#REF!"}}]
["F","SEST","LAN",5,397798,"HAOUZI","Leila",2002,69.2,"Narbonne Haltéro","F",15,17,19,{"$f":"IF(MAXA(L53+M53,M53+N53,L53+N53,L53,M53,N53)<=0,0,MAXA(L53+M53,M53+N53,L53+N53,L53,M53,N53))","v":36},-27,-29,29,{"$f":"IF(MAXA(P53+Q53,Q53+R53,P53+R53,P53,Q53,R53)<=0,0,MAXA(P53+Q53,Q53+R53,P53+R53,P53,Q53,R53))","v":29},{"$f":"IF(H53=\"\",\"\",IF(OR(O53=0,S53=0),0,O53+S53))","v":65},{"$f":"IF(I53=\"\",\"\",IF(A53=\"H\",10^(0.794358141*LOG(I53/174.393)^2)*T53,IF(A53=\"F\",10^(0.89726074 * LOG(I53/148.026)^2)*T53,\"\")))","v":81.425875020539394},{"$f":"SUM(T53-I53)","v":-4.2000000000000028},null,{"$f":"IF(A53=\"F\",(IF(OR(H53>2001,H53<2004),VLOOKUP(I53,Feuil1!$G$11:$H$25,2))),IF(A53=\"H\",(IF(OR(H53>2001,H53<2004),VLOOKUP(I53,Feuil1!$A$11:$F$29,2)))))","v":"FM+58"},null,{"$f":"T53-HLOOKUP(X53,#REF!,2,FALSE)","v":{"$error":"#REF!"}},{"$f":"T53-HLOOKUP(X53,#REF!,3,FALSE)","v":{"$error":"#REF!"}},{"$f":"T53-HLOOKUP(X53,#REF!,4,FALSE)","v":{"$error":"#REF!"}},{"$f":"T53-HLOOKUP(X53,#REF!,5,FALSE)","v":{"$error":"#REF!"}},{"$f":"T53-HLOOKUP(X53,#REF!,6,FALSE)","v":{"$error":"#REF!"}},{"$f":"T53-HLOOKUP(X53,#REF!,7,FALSE)","v":{"$error":"#REF!"}},{"$f":"T53-HLOOKUP(X53,#REF!,8,FALSE)","v":{"$error":"#REF!"}},{"$f":"T53-HLOOKUP(X53,#REF!,9,FALSE)","v":{"$error":"#REF!"}},null,null,null,null,null,null,null,{"$f":"IF(AG53>=0,$AG$4,IF(AF53>=0,$AF$4,IF(AE53>=0,$AE$4,IF(AD53>=0,$AD$4,IF(AC53>=0,$AC$4,IF(AB53>=0,$AB$4,IF(AA53>=0,$AA$4,IF(Z53>=0,$Z$4,$AH$4))))))))","v":{"$error":"#REF!"}}]
[null,null,null,null,null,null,null,null,null,null,null,null,null,null,null,null,null,null,null,null,null,null,null,null,null,null," ",{"$f":"T54-HLOOKUP(X54,[1]Feuil1!$C$1:$BL$10,2,FALSE)","v":{"$error":"#N/A"}},{"$f":"T54-HLOOKUP(X54,[1]Feuil1!$C$1:$BL$10,3,FALSE)","v":{"$error":"#N/A"}},{"$f":"T54-HLOOKUP(X54,[1]Feuil1!$C$1:$BL$10,4,FALSE)","v":{"$error":"#N/A"}},{"$f":"T54-HLOOKUP(X54,[1]Feuil1!$C$1:$BL$10,5,FALSE)","v":{"$error":"#N/A"}},{"$f":"T54-HLOOKUP(X54,[1]Feuil1!$C$1:$BL$10,6,FALSE)","v":{"$error":"#N/A"}},{"$f":"T54-HLOOKUP(X54,[1]Feuil1!$C$1:$BL$10,7,FALSE)","v":{"$error":"#N/A"}},{"$f":"T54-HLOOKUP(X54,[1]Feuil1!$C$1:$BL$10,8,FALSE)","v":{"$error":"#N/A"}},{"$f":"T54-HLOOKUP(X54,[1]Feuil1!$C$1:$BL$10,9,FALSE)","v":{"$error":"#N/A"}},{"$f":"T54-HLOOKUP(X54,[1]Feuil1!$C$1:$BL$10,10,FALSE)","v":{"$error":"#N/A"}},null,null,null,null,null,null,{"$f":"IF(AJ54>=0,$AJ$4,IF(AI54>=0,$AI$4,IF(AH54>=0,$AH$4,IF(AG54>=0,$AG$4,IF(AF54>=0,$AF$4,IF(AE54>=0,$AE$4,IF(AD54>=0,$AD$4,IF(AC54>=0,$AC$4,$AB$4))))))))","v":{"$error":"#N/A"}}]
[]
[]
[]
[]
[]
[]
[]
[]
[]
[]
[]
[]
[]
[]
[]
[]
[]
[]
[]
[]
[]
[]
[]
[]
[]
[]
[]
[]
[]
[]
[]
[]
[]
[]
[]
[]
[]
[]
[]
[]
[]
[]
[]
[]
[]
[]
[]
[]
[]
[]
[]
[]
[]
[]
[]
[]
[]
[]
[]
[]
[]
[]
[]
[]
[]
[]
[]
[]
[]
[]
[]
[]
[]
[]
[]
[]
[]
[]
[]
[]
[]
[]
[]
[]
[]
[]
[]
[]
[]
[]
[]
[]
[]
[]
[]
[]
[]
[]
[]
[]
[]
[]
[]
[]
[]
[]
[]
[]
[]
[]
[]
[]
[]
[]
[]
[]
[]
[]
[]
[]
[]
[]
[]
[]
[]
[]
[]
[]
[]
[]
[]
[]
[]
[]
[]
[]
[]
[]
[]
[]
[]
[]
[]
[]
[]
[]
[]
[]
[]
[]
[]
[]
[]
[]
[]
[]
[]
[]
[]
[]
[]
[]
[]
[]
[]
[]
[]
[]
[]
[]
[]
[]
[]
[]
[]
[]
[]
[]
[]
[]
[]
[]
[]
[]
[]
[]
[]
[]
[]
[]
[]
[]
[]
[]
[]
[]
[]
[]
[]
[]
[]
[]
[]
[]
[]
[]
[]
[]
[]
[]
[]
[]
[]
[]
[]
[]
[]
[]
[]
[]
[]
[]
[]
[]
[]
[]
[]
[]
[]
[]
[]
[]
[]
[]
[]
[]
[]
[]
[]
[]
[]
[]
[]
[]
[]
[]
[]
[]
[]
[]
[]
[]
[]
[]
[]
[]
[]
[]
[]
[]
[]
[]
[]
[]
[]
[]
[]
[]
[]
[]
[]
[]
[]
[]
[]
[]
[]
[]
[]
[]
[]
[]
[]
[]
[]
[]
[]
[]
[]
[]
[]
[]
[]
[]
[]
[]
[]
[]
[]
[]
[]
[]
[]
[]
[]
[]
[]
[]
[]
[]
[]
[]
[]
[]
[]
[]
[]
[]
[]
[]
[]
[]
[]
[]
[]
[]
[]
[]
[]
[]
[]
[]
[]
[]
[]
[]
[]
[]
[]
[]
[]
[]
[]
[]
[]
[]
[]
[]
[]
[]
[]
[]
[]
[]
[]
[]
[]
[]
[]
[]
[]
[]
[]
[]
[]
[]
[]
[]
[]
[]
[]
[]
[]
[]
[]
[]
[]
[]
[]
[]
[]
[]
[]
[]
[]
[]
[]
[]
[]
[]
[]
[]
[]
[]
[]
[]
[]
[]
[]
[]
[]
[]
[]
[]
[]
[]
[]
[]
[]
[]
[]
[]
[]
[]
[]
[]
[]
[]
[]
[]
[]
[]
[]
[]
[]
[]
[]
[]
[]
[]
[]
[]
[]
[]
[]
[]
[]
[]
[]
[]
[]
[]
[]
[]
[]
[]
[]
[]
[]
[]
[]
[]
[]
[]
[]
[]
[]
[]
[]
[]
[]
[]
[]
[]
[]
[]
[]
[]
[]
[]
[]
[]
[]
[]
[]
[]
[]
[]
[]
[]
[]
[]
[]
[]
[]
[]
[]
[]
[]
[]
[]
[]
[]
[]
[]
[]
[]
[]
[]
[null,null,null,null,null,null,null,null,null,null,null,null,null,null,null,null,null,null,null,null,null,null,null,null,"J69","J77","J85","J94","J105","J+105",null,"J56","J62","J69","J77","J85","J94","J105","J+105",null,"S56","S62","S69","S77","S85","S94","S105","S+105"]
[null,null,null,null,null,null,null,null,null,null,null,null,null,null,null,null,null,null,null,null,null,null,null,null,130,145,160,170,180,190,null,100,115,130,145,160,170,180,190,null,115,135,150,165,180,190,200,210]
[null,null,null,null,null,null,null,null,null,null,null,null,null,null,null,null,null,null,null,null,null,null,null,null,150,165,180,190,200,210,null,115,135,150,165,180,190,200,210,null,130,150,165,185,200,210,220,230]
[null,null,null,null,null,null,null,null,null,null,null,null,null,null,null,null,null,null,null,null,null,null,null,null,165,185,200,210,220,230,null,130,150,165,185,200,210,220,230,null,145,165,180,200,220,230,240,250]
[null,null,null,null,null,null,null,null,null,null,null,null,null,null,null,null,null,null,null,null,null,null,null,null,180,200,220,230,240,250,null,145,165,180,200,220,230,240,250,null,175,195,215,235,250,260,275,280]
[null,null,null,null,null,null,null,null,null,null,null,null,null,null,null,null,null,null,null,null,null,null,null,null,215,235,250,260,275,280,null,175,195,215,235,250,260,275,280,null,210,230,250,270,290,300,310,325]
[null,null,null,null,null,null,null,null,null,null,null,null,null,null,null,null,null,null,null,null,null,null,null,null,250,270,290,300,310,325,null,210,230,250,270,290,300,310,325,null,230,255,275,300,315,335,345,355]
[null,null,null,null,null,null,null,null,null,null,null,null,null,null,null,null,null,null,null,null,null,null,null,null,295,320,335,355,370,380,null,245,270,295,320,335,355,370,380,null,245,270,295,320,335,355,370,380]

{"sheet":"MINIMES GARCONS","index":1,"n_rows":672,"n_cols":48,"rows_kept":672,"cut":false,"hidden":false,"merged":[[0,6,0,14],[0,18,0,21],[1,5,1,10],[1,11,1,13],[1,14,1,17],[1,18,1,19],[1,21,1,22]]}
[null,null,null,"LISTING NATIONAL",null,null,"MINIMES GARCONS",null,null,null,null,null,null,null,null,null,"DATE :",null,"2015-06-30"]
[null,null,null," ",null,"2014-2015",null,null,null,null,null,"3° TRIMESTRE"]
[]
["SEXE","ZONE","REG.","Place","LICENCE","NOMS","Prénoms","AN","POIDS","CLUB","NAT",1,2,3,"ARR",1,2,3,"EP-J","TOTAL","IWF","Points",null,"Catég"," ","DEP +","REG +","IRG +","FED +","NAT +","INTB +","INTA +","OLY +","NCL"]
[null,null,null,null,null,null,null,null,null,null,null,null,null,null,null,null,null,null,null,null,null,null,null,null,null,null," ",{"$f":"T5-HLOOKUP(X5,[1]Feuil1!$C$1:$BL$10,2,FALSE)","v":{"$error":"#N/A"}},{"$f":"T5-HLOOKUP(X5,[1]Feuil1!$C$1:$BL$10,3,FALSE)","v":{"$error":"#N/A"}},{"$f":"T5-HLOOKUP(X5,[1]Feuil1!$C$1:$BL$10,4,FALSE)","v":{"$error":"#N/A"}},{"$f":"T5-HLOOKUP(X5,[1]Feuil1!$C$1:$BL$10,5,FALSE)","v":{"$error":"#N/A"}},{"$f":"T5-HLOOKUP(X5,[1]Feuil1!$C$1:$BL$10,6,FALSE)","v":{"$error":"#N/A"}},{"$f":"T5-HLOOKUP(X5,[1]Feuil1!$C$1:$BL$10,7,FALSE)","v":{"$error":"#N/A"}},{"$f":"T5-HLOOKUP(X5,[1]Feuil1!$C$1:$BL$10,8,FALSE)","v":{"$error":"#N/A"}},{"$f":"T5-HLOOKUP(X5,[1]Feuil1!$C$1:$BL$10,9,FALSE)","v":{"$error":"#N/A"}},{"$f":"T5-HLOOKUP(X5,[1]Feuil1!$C$1:$BL$10,10,FALSE)","v":{"$error":"#N/A"}},null,null,null,null,null,null,{"$f":"IF(AJ5>=0,$AJ$4,IF(AI5>=0,$AI$4,IF(AH5>=0,$AH$4,IF(AG5>=0,$AG$4,IF(AF5>=0,$AF$4,IF(AE5>=0,$AE$4,IF(AD5>=0,$AD$4,IF(AC5>=0,$AC$4,$AB$4))))))))","v":{"$error":"#N/A"}}]
["H","CO","PDL",1,355921,"COGNON","Théo",2002,39.4,"CJF LAVAL - VOUTRÉ","F",38,40,42,{"$f":"IF(MAXA(L6+M6,M6+N6,L6+N6,L6,M6,N6)<=0,0,MAXA(L6+M6,M6+N6,L6+N6,L6,M6,N6))","v":82},48,50,52,{"$f":"IF(MAXA(P6+Q6,Q6+R6,P6+R6,P6,Q6,R6)<=0,0,MAXA(P6+Q6,Q6+R6,P6+R6,P6,Q6,R6))","v":102},{"$f":"IF(H6=\"\",\"\",IF(OR(O6=0,S6=0),0,O6+S6))","v":184},{"$f":"IF(I6=\"\",\"\",IF(A6=\"H\",10^(0.794358141*LOG(I6/174.393)^2)*T6,IF(A6=\"F\",10^(0.89726074 * LOG(I6/148.026)^2)*T6,\"\")))","v":394.77521288907394},{"$f":"SUM(T6-I6)","v":144.6},null,{"$f":"IF(A6=\"F\",(IF(OR(H6>2001,H6<2004),VLOOKUP(I6,Feuil1!$G$11:$H$25,2))),IF(A6=\"H\",(IF(OR(H6>2001,H6<2004),VLOOKUP(I6,Feuil1!$A$11:$F$29,2)))))","v":"M40"},null,{"$f":"T6-HLOOKUP(X6,#REF!,2,FALSE)","v":{"$error":"#REF!"}},{"$f":"T6-HLOOKUP(X6,#REF!,3,FALSE)","v":{"$error":"#REF!"}},{"$f":"T6-HLOOKUP(X6,#REF!,4,FALSE)","v":{"$error":"#REF!"}},{"$f":"T6-HLOOKUP(X6,#REF!,5,FALSE)","v":{"$error":"#REF!"}},{"$f":"T6-HLOOKUP(X6,#REF!,6,FALSE)","v":{"$error":"#REF!"}},{"$f":"T6-HLOOKUP(X6,#REF!,7,FALSE)","v":{"$error":"#REF!"}},{"$f":"T6-HLOOKUP(X6,#REF!,8,FALSE)","v":{"$error":"#REF!"}},{"$f":"T6-HLOOKUP(X6,#REF!,9,FALSE)","v":{"$error":"#REF!"}},null,null,null,null,null,null,null,{"$f":"IF(AG6>=0,$AG$4,IF(AF6>=0,$AF$4,IF(AE6>=0,$AE$4,IF(AD6>=0,$AD$4,IF(AC6>=0,$AC$4,IF(AB6>=0,$AB$4,IF(AA6>=0,$AA$4,IF(Z6>=0,$Z$4,$AH$4))))))))","v":{"$error":"#REF!"}}]
["H","NORD","NPC",2,248952,"BUYSSCHAERT","Tristan",2003,36.299999999999997,"CHCD COMINES","F",29,31,33,64,40,42,44,86,150,350.87894022624391,113.7,null,{"$f":"IF(A7=\"F\",(IF(OR(H7>2001,H7<2004),VLOOKUP(I7,Feuil1!$G$11:$H$25,2))),IF(A7=\"H\",(IF(OR(H7>2001,H7<2004),VLOOKUP(I7,Feuil1!$A$11:$F$29,2)))))","v":"M40"},null,{"$f":"T7-HLOOKUP(X7,#REF!,2,FALSE)","v":{"$error":"#REF!"}},{"$f":"T7-HLOOKUP(X7,#REF!,3,FALSE)","v":{"$error":"#REF!"}},{"$f":"T7-HLOOKUP(X7,#REF!,4,FALSE)","v":{"$error":"#REF!"}},{"$f":"T7-HLOOKUP(X7,#REF!,5,FALSE)","v":{"$error":"#REF!"}},{"$f":"T7-HLOOKUP(X7,#REF!,6,FALSE)","v":{"$error":"#REF!"}},{"$f":"T7-HLOOKUP(X7,#REF!,7,FALSE)","v":{"$error":"#REF!"}},{"$f":"T7-HLOOKUP(X7,#REF!,8,FALSE)","v":{"$error":"#REF!"}},{"$f":"T7-HLOOKUP(X7,#REF!,9,FALSE)","v":{"$error":"#REF!"}},null,null,null,null,null,null,null,{"$error":"#REF!"}]
["H","ZCO","BRE",3,355330,"OLLIVIER","Leny",2003,36.270000000000003,"AL QUIMPER","F",27,28,29,57,39,40,42,82,139,325.43914047192925,102.72999999999999,null,{"$f":"IF(A8=\"F\",(IF(OR(H8>2001,H8<2004),VLOOKUP(I8,Feuil1!$G$11:$H$25,2))),IF(A8=\"H\",(IF(OR(H8>2001,H8<2004),VLOOKUP(I8,Feuil1!$A$11:$F$29,2)))))","v":"M40"},null,{"$f":"T8-HLOOKUP(X8,#REF!,2,FALSE)","v":{"$error":"#REF!"}},{"$f":"T8-HLOOKUP(X8,#REF!,3,FALSE)","v":{"$error":"#REF!"}},{"$f":"T8-HLOOKUP(X8,#REF!,4,FALSE)","v":{"$error":"#REF!"}},{"$f":"T8-HLOOKUP(X8,#REF!,5,FALSE)","v":{"$error":"#REF!"}},{"$f":"T8-HLOOKUP(X8,#REF!,6,FALSE)","v":{"$error":"#REF!"}},{"$f":"T8-HLOOKUP(X8,#REF!,7,FALSE)","v":{"$error":"#REF!"}},{"$f":"T8-HLOOKUP(X8,#REF!,8,FALSE)","v":{"$error":"#REF!"}},{"$f":"T8-HLOOKUP(X8,#REF!,9,FALSE)","v":{"$error":"#REF!"}},null,null,null,null,null,null,null,{"$error":"#REF!"}]
["H","SEST","RAL",4,359944,"CHABERT","Lucas",2003,39.33,"La Ricamarie","F",25,26,28,54,32,34,36,70,124,266.53045895746544,84.67,null,{"$f":"IF(A9=\"F\",(IF(OR(H9>2001,H9<2004),VLOOKUP(I9,Feuil1!$G$11:$H$25,2))),IF(A9=\"H\",(IF(OR(H9>2001,H9<2004),VLOOKUP(I9,Feuil1!$A$11:$F$29,2)))))","v":"M40"},null,{"$f":"T9-HLOOKUP(X9,#REF!,2,FALSE)","v":{"$error":"#REF!"}},{"$f":"T9-HLOOKUP(X9,#REF!,3,FALSE)","v":{"$error":"#REF!"}},{"$f":"T9-HLOOKUP(X9,#REF!,4,FALSE)","v":{"$error":"#REF!"}},{"$f":"T9-HLOOKUP(X9,#REF!,5,FALSE)","v":{"$error":"#REF!"}},{"$f":"T9-HLOOKUP(X9,#REF!,6,FALSE)","v":{"$error":"#REF!"}},{"$f":"T9-HLOOKUP(X9,#REF!,7,FALSE)","v":{"$error":"#REF!"}},{"$f":"T9-HLOOKUP(X9,#REF!,8,FALSE)","v":{"$error":"#REF!"}},{"$f":"T9-HLOOKUP(X9,#REF!,9,FALSE)","v":{"$error":"#REF!"}},null,null,null,null,null,null,null,{"$error":"#REF!"}]
["H","SO","MPY",5,378627,"VALEAN","Andrei",2003,39.9,"FIGEAC HC","R",23,25,27,52,31,33,35,68,120,254.16519033566215,80.099999999999994,null,{"$f":"IF(A10=\"F\",(IF(OR(H10>2001,H10<2004),VLOOKUP(I10,Feuil1!$G$11:$H$25,2))),IF(A10=\"H\",(IF(OR(H10>2001,H10<2004),VLOOKUP(I10,Feuil1!$A$11:$F$29,2)))))","v":"M40"},null,{"$f":"T10-HLOOKUP(X10,#REF!,2,FALSE)","v":{"$error":"#REF!"}},{"$f":"T10-HLOOKUP(X10,#REF!,3,FALSE)","v":{"$error":"#REF!"}},{"$f":"T10-HLOOKUP(X10,#REF!,4,FALSE)","v":{"$error":"#REF!"}},{"$f":"T10-HLOOKUP(X10,#REF!,5,FALSE)","v":{"$error":"#REF!"}},{"$f":"T10-HLOOKUP(X10,#REF!,6,FALSE)","v":{"$error":"#REF!"}},{"$f":"T10-HLOOKUP(X10,#REF!,7,FALSE)","v":{"$error":"#REF!"}},{"$f":"T10-HLOOKUP(X10,#REF!,8,FALSE)","v":{"$error":"#REF!"}},{"$f":"T10-HLOOKUP(X10,#REF!,9,FALSE)","v":{"$error":"#REF!"}},null,null,null,null,null,null,null,{"$error":"#REF!"}]
["H","SEST","RAL",6,373869,"MATHUREL","Lucas",2002,38.71,"CH Saint Baldoph","F",22,24,-26,46,32,34,36,70,116,253.46158430165556,77.289999999999992,null,{"$f":"IF(A11=\"F\",(IF(OR(H11>2001,H11<2004),VLOOKUP(I11,Feuil1!$G$11:$H$25,2))),IF(A11=\"H\",(IF(OR(H11>2001,H11<2004),VLOOKUP(I11,Feuil1!$A$11:$F$29,2)))))","v":"M40"},null,{"$f":"T11-HLOOKUP(X11,#REF!,2,FALSE)","v":{"$error":"#REF!"}},{"$f":"T11-HLOOKUP(X11,#REF!,3,FALSE)","v":{"$error":"#REF!"}},{"$f":"T11-HLOOKUP(X11,#REF!,4,FALSE)","v":{"$error":"#REF!"}},{"$f":"T11-HLOOKUP(X11,#REF!,5,FALSE)","v":{"$error":"#REF!"}},{"$f":"T11-HLOOKUP(X11,#REF!,6,FALSE)","v":{"$error":"#REF!"}},{"$f":"T11-HLOOKUP(X11,#REF!,7,FALSE)","v":{"$error":"#REF!"}},{"$f":"T11-HLOOKUP(X11,#REF!,8,FALSE)","v":{"$error":"#REF!"}},{"$f":"T11-HLOOKUP(X11,#REF!,9,FALSE)","v":{"$error":"#REF!"}},null,null,null,null,null,null,null,{"$error":"#REF!"}]
["H","SEST","PRO",7,320573,"POUBLAN","Thomas",2002,33.17,"EEAR. MONTEUX","F",20,22,24,46,30,32,34,66,112,289.6743796725101,78.83,null,{"$f":"IF(A12=\"F\",(IF(OR(H12>2001,H12<2004),VLOOKUP(I12,Feuil1!$G$11:$H$25,2))),IF(A12=\"H\",(IF(OR(H12>2001,H12<2004),VLOOKUP(I12,Feuil1!$A$11:$F$29,2)))))","v":"M40"},null,{"$f":"T12-HLOOKUP(X12,#REF!,2,FALSE)","v":{"$error":"#REF!"}},{"$f":"T12-HLOOKUP(X12,#REF!,3,FALSE)","v":{"$error":"#REF!"}},{"$f":"T12-HLOOKUP(X12,#REF!,4,FALSE)","v":{"$error":"#REF!"}},{"$f":"T12-HLOOKUP(X12,#REF!,5,FALSE)","v":{"$error":"#REF!"}},{"$f":"T12-HLOOKUP(X12,#REF!,6,FALSE)","v":{"$error":"#REF!"}},{"$f":"T12-HLOOKUP(X12,#REF!,7,FALSE)","v":{"$error":"#REF!"}},{"$f":"T12-HLOOKUP(X12,#REF!,8,FALSE)","v":{"$error":"#REF!"}},{"$f":"T12-HLOOKUP(X12,#REF!,9,FALSE)","v":{"$error":"#REF!"}},null,null,null,null,null,null,null,{"$error":"#REF!"}]
["H","NORD","PIC",8,323797,"MARTIN","Thomas",2002,31.57,"Saleux CHM","F",23,25,26,51,29,30,-32,59,110,301.32676188884471,78.430000000000007,null,{"$f":"IF(A13=\"F\",(IF(OR(H13>2001,H13<2004),VLOOKUP(I13,Feuil1!$G$11:$H$25,2))),IF(A13=\"H\",(IF(OR(H13>2001,H13<2004),VLOOKUP(I13,Feuil1!$A$11:$F$29,2)))))","v":"M40"},null,{"$f":"T13-HLOOKUP(X13,#REF!,2,FALSE)","v":{"$error":"#REF!"}},{"$f":"T13-HLOOKUP(X13,#REF!,3,FALSE)","v":{"$error":"#REF!"}},{"$f":"T13-HLOOKUP(X13,#REF!,4,FALSE)","v":{"$error":"#REF!"}},{"$f":"T13-HLOOKUP(X13,#REF!,5,FALSE)","v":{"$error":"#REF!"}},{"$f":"T13-HLOOKUP(X13,#REF!,6,FALSE)","v":{"$error":"#REF!"}},{"$f":"T13-HLOOKUP(X13,#REF!,7,FALSE)","v":{"$error":"#REF!"}},{"$f":"T13-HLOOKUP(X13,#REF!,8,FALSE)","v":{"$error":"#REF!"}},{"$f":"T13-HLOOKUP(X13,#REF!,9,FALSE)","v":{"$error":"#REF!"}},null,null,null,null,null,null,null,{"$error":"#REF!"}]
["H","SEST","CAZ",9,391434,"MERIAUX ","Tom",2002,38.9,"ES VILLENEUVE LOUBET","F",-20,20,22,42,32,34,-36,66,108,234.78648425716207,69.099999999999994,null,{"$f":"IF(A14=\"F\",(IF(OR(H14>2001,H14<2004),VLOOKUP(I14,Feuil1!$G$11:$H$25,2))),IF(A14=\"H\",(IF(OR(H14>2001,H14<2004),VLOOKUP(I14,Feuil1!$A$11:$F$29,2)))))","v":"M40"},null,{"$f":"T14-HLOOKUP(X14,#REF!,2,FALSE)","v":{"$error":"#REF!"}},{"$f":"T14-HLOOKUP(X14,#REF!,3,FALSE)","v":{"$error":"#REF!"}},{"$f":"T14-HLOOKUP(X14,#REF!,4,FALSE)","v":{"$error":"#REF!"}},{"$f":"T14-HLOOKUP(X14,#REF!,5,FALSE)","v":{"$error":"#REF!"}},{"$f":"T14-HLOOKUP(X14,#REF!,6,FALSE)","v":{"$error":"#REF!"}},{"$f":"T14-HLOOKUP(X14,#REF!,7,FALSE)","v":{"$error":"#REF!"}},{"$f":"T14-HLOOKUP(X14,#REF!,8,FALSE)","v":{"$error":"#REF!"}},{"$f":"T14-HLOOKUP(X14,#REF!,9,FALSE)","v":{"$error":"#REF!"}},null,null,null,null,null,null,null,{"$error":"#REF!"}]
["H","NE","LOR",10,251046,"DUCHAUFFOUR","Lucas",2003,28.26,"H.VALLEROY-AUBOUÉ","F",20,21,22,43,30,31,32,63,106,332.28658724592663,77.739999999999995,null,{"$f":"IF(A15=\"F\",(IF(OR(H15>2001,H15<2004),VLOOKUP(I15,Feuil1!$G$11:$H$25,2))),IF(A15=\"H\",(IF(OR(H15>2001,H15<2004),VLOOKUP(I15,Feuil1!$A$11:$F$29,2)))))","v":"M40"},null,{"$f":"T15-HLOOKUP(X15,#REF!,2,FALSE)","v":{"$error":"#REF!"}},{"$f":"T15-HLOOKUP(X15,#REF!,3,FALSE)","v":{"$error":"#REF!"}},{"$f":"T15-HLOOKUP(X15,#REF!,4,FALSE)","v":{"$error":"#REF!"}},{"$f":"T15-HLOOKUP(X15,#REF!,5,FALSE)","v":{"$error":"#REF!"}},{"$f":"T15-HLOOKUP(X15,#REF!,6,FALSE)","v":{"$error":"#REF!"}},{"$f":"T15-HLOOKUP(X15,#REF!,7,FALSE)","v":{"$error":"#REF!"}},{"$f":"T15-HLOOKUP(X15,#REF!,8,FALSE)","v":{"$error":"#REF!"}},{"$f":"T15-HLOOKUP(X15,#REF!,9,FALSE)","v":{"$error":"#REF!"}},null,null,null,null,null,null,null,{"$error":"#REF!"}]
["H","NORD","NPC",11,392615,"LECOINTRE","Charles",2003,39.700000000000003,"CHCD COMINES","F",20,22,24,46,29,-31,31,60,106,225.66562409862544,66.3,null,{"$f":"IF(A16=\"F\",(IF(OR(H16>2001,H16<2004),VLOOKUP(I16,Feuil1!$G$11:$H$25,2))),IF(A16=\"H\",(IF(OR(H16>2001,H16<2004),VLOOKUP(I16,Feuil1!$A$11:$F$29,2)))))","v":"M40"},null,{"$f":"T16-HLOOKUP(X16,#REF!,2,FALSE)","v":{"$error":"#REF!"}},{"$f":"T16-HLOOKUP(X16,#REF!,3,FALSE)","v":{"$error":"#REF!"}},{"$f":"T16-HLOOKUP(X16,#REF!,4,FALSE)","v":{"$error":"#REF!"}},{"$f":"T16-HLOOKUP(X16,#REF!,5,FALSE)","v":{"$error":"#REF!"}},{"$f":"T16-HLOOKUP(X16,#REF!,6,FALSE)","v":{"$error":"#REF!"}},{"$f":"T16-HLOOKUP(X16,#REF!,7,FALSE)","v":{"$error":"#REF!"}},{"$f":"T16-HLOOKUP(X16,#REF!,8,FALSE)","v":{"$error":"#REF!"}},{"$f":"T16-HLOOKUP(X16,#REF!,9,FALSE)","v":{"$error":"#REF!"}},null,null,null,null,null,null,null,{"$error":"#REF!"}]
["H","N","IDF",12,335649,"LEDEAN","LOUAN",2002,38.57,"PONTOISE","F",19,21,23,44,27,29,31,60,104,228.09914595043639,65.430000000000007,null,{"$f":"IF(A17=\"F\",(IF(OR(H17>2001,H17<2004),VLOOKUP(I17,Feuil1!$G$11:$H$25,2))),IF(A17=\"H\",(IF(OR(H17>2001,H17<2004),VLOOKUP(I17,Feuil1!$A$11:$F$29,2)))))","v":"M40"},null,{"$f":"T17-HLOOKUP(X17,#REF!,2,FALSE)","v":{"$error":"#REF!"}},{"$f":"T17-HLOOKUP(X17,#REF!,3,FALSE)","v":{"$error":"#REF!"}},{"$f":"T17-HLOOKUP(X17,#REF!,4,FALSE)","v":{"$error":"#REF!"}},{"$f":"T17-HLOOKUP(X17,#REF!,5,FALSE)","v":{"$error":"#REF!"}},{"$f":"T17-HLOOKUP(X17,#REF!,6,FALSE)","v":{"$error":"#REF!"}},{"$f":"T17-HLOOKUP(X17,#REF!,7,FALSE)","v":{"$error":"#REF!"}},{"$f":"T17-HLOOKUP(X17,#REF!,8,FALSE)","v":{"$error":"#REF!"}},{"$f":"T17-HLOOKUP(X17,#REF!,9,FALSE)","v":{"$error":"#REF!"}},null,null,null,null,null,null,null,{"$error":"#REF!"}]
["H","NORD","NPC",13,369340,"FOURNIER","Romain",2002,37.700000000000003,"ST POL/MER","F",18,20,22,42,26,28,30,58,100,224.63807024801272,62.3,null,{"$f":"IF(A18=\"F\",(IF(OR(H18>2001,H18<2004),VLOOKUP(I18,Feuil1!$G$11:$H$25,2))),IF(A18=\"H\",(IF(OR(H18>2001,H18<2004),VLOOKUP(I18,Feuil1!$A$11:$F$29,2)))))","v":"M40"},null,{"$f":"T18-HLOOKUP(X18,#REF!,2,FALSE)","v":{"$error":"#REF!"}},{"$f":"T18-HLOOKUP(X18,#REF!,3,FALSE)","v":{"$error":"#REF!"}},{"$f":"T18-HLOOKUP(X18,#REF!,4,FALSE)","v":{"$error":"#REF!"}},{"$f":"T18-HLOOKUP(X18,#REF!,5,FALSE)","v":{"$error":"#REF!"}},{"$f":"T18-HLOOKUP(X18,#REF!,6,FALSE)","v":{"$error":"#REF!"}},{"$f":"T18-HLOOKUP(X18,#REF!,7,FALSE)","v":{"$error":"#REF!"}},{"$f":"T18-HLOOKUP(X18,#REF!,8,FALSE)","v":{"$error":"#REF!"}},{"$f":"T18-HLOOKUP(X18,#REF!,9,FALSE)","v":{"$error":"#REF!"}},null,null,null,null,null,null,null,{"$error":"#REF!"}]
["H","ZCO","BRE",14,377882,"ENARD","Thibaut",2002,38.6,"AL QUIMPER","F",20,21,23,44,26,27,29,56,100,219.14869177457342,61.4,null,{"$f":"IF(A19=\"F\",(IF(OR(H19>2001,H19<2004),VLOOKUP(I19,Feuil1!$G$11:$H$25,2))),IF(A19=\"H\",(IF(OR(H19>2001,H19<2004),VLOOKUP(I19,Feuil1!$A$11:$F$29,2)))))","v":"M40"},null,{"$f":"T19-HLOOKUP(X19,#REF!,2,FALSE)","v":{"$error":"#REF!"}},{"$f":"T19-HLOOKUP(X19,#REF!,3,FALSE)","v":{"$error":"#REF!"}},{"$f":"T19-HLOOKUP(X19,#REF!,4,FALSE)","v":{"$error":"#REF!"}},{"$f":"T19-HLOOKUP(X19,#REF!,5,FALSE)","v":{"$error":"#REF!"}},{"$f":"T19-HLOOKUP(X19,#REF!,6,FALSE)","v":{"$error":"#REF!"}},{"$f":"T19-HLOOKUP(X19,#REF!,7,FALSE)","v":{"$error":"#REF!"}},{"$f":"T19-HLOOKUP(X19,#REF!,8,FALSE)","v":{"$error":"#REF!"}},{"$f":"T19-HLOOKUP(X19,#REF!,9,FALSE)","v":{"$error":"#REF!"}},null,null,null,null,null,null,null,{"$error":"#REF!"}]
["H","ZCO","CEN",15,378393,"BAH","Idriss",2002,35.049999999999997,"AAJ BLOIS","F",19,20,21,41,26,28,29,57,98,238.20802744608073,62.95,null,{"$f":"IF(A20=\"F\",(IF(OR(H20>2001,H20<2004),VLOOKUP(I20,Feuil1!$G$11:$H$25,2))),IF(A20=\"H\",(IF(OR(H20>2001,H20<2004),VLOOKUP(I20,Feuil1!$A$11:$F$29,2)))))","v":"M40"},null,{"$f":"T20-HLOOKUP(X20,#REF!,2,FALSE)","v":{"$error":"#REF!"}},{"$f":"T20-HLOOKUP(X20,#REF!,3,FALSE)","v":{"$error":"#REF!"}},{"$f":"T20-HLOOKUP(X20,#REF!,4,FALSE)","v":{"$error":"#REF!"}},{"$f":"T20-HLOOKUP(X20,#REF!,5,FALSE)","v":{"$error":"#REF!"}},{"$f":"T20-HLOOKUP(X20,#REF!,6,FALSE)","v":{"$error":"#REF!"}},{"$f":"T20-HLOOKUP(X20,#REF!,7,FALSE)","v":{"$error":"#REF!"}},{"$f":"T20-HLOOKUP(X20,#REF!,8,FALSE)","v":{"$error":"#REF!"}},{"$f":"T20-HLOOKUP(X20,#REF!,9,FALSE)","v":{"$error":"#REF!"}},null,null,null,null,null,null,null,{"$error":"#REF!"}]
["H","NE","ALS",16,375712,"VOLTZ","ANTOINE",2003,40,"SHC Haguenau","F",18,20,22,42,23,25,27,52,94,198.5899749728415,54,null,{"$f":"IF(A21=\"F\",(IF(OR(H21>2001,H21<2004),VLOOKUP(I21,Feuil1!$G$11:$H$25,2))),IF(A21=\"H\",(IF(OR(H21>2001,H21<2004),VLOOKUP(I21,Feuil1!$A$11:$F$29,2)))))","v":"M40"},null,{"$f":"T21-HLOOKUP(X21,#REF!,2,FALSE)","v":{"$error":"#REF!"}},{"$f":"T21-HLOOKUP(X21,#REF!,3,FALSE)","v":{"$error":"#REF!"}},{"$f":"T21-HLOOKUP(X21,#REF!,4,FALSE)","v":{"$error":"#REF!"}},{"$f":"T21-HLOOKUP(X21,#REF!,5,FALSE)","v":{"$error":"#REF!"}},{"$f":"T21-HLOOKUP(X21,#REF!,6,FALSE)","v":{"$error":"#REF!"}},{"$f":"T21-HLOOKUP(X21,#REF!,7,FALSE)","v":{"$error":"#REF!"}},{"$f":"T21-HLOOKUP(X21,#REF!,8,FALSE)","v":{"$error":"#REF!"}},{"$f":"T21-HLOOKUP(X21,#REF!,9,FALSE)","v":{"$error":"#REF!"}},null,null,null,null,null,null,null,{"$error":"#REF!"}]
["H","ZCO","BRE",17,378678,"VANLOQUEREN","Jolan",2003,35.700000000000003,"CHM Plouhinec","F",18,20,22,42,24,-26,26,50,92,219.14622684808916,56.3,null,{"$f":"IF(A22=\"F\",(IF(OR(H22>2001,H22<2004),VLOOKUP(I22,Feuil1!$G$11:$H$25,2))),IF(A22=\"H\",(IF(OR(H22>2001,H22<2004),VLOOKUP(I22,Feuil1!$A$11:$F$29,2)))))","v":"M40"},null,{"$f":"T22-HLOOKUP(X22,#REF!,2,FALSE)","v":{"$error":"#REF!"}},{"$f":"T22-HLOOKUP(X22,#REF!,3,FALSE)","v":{"$error":"#REF!"}},{"$f":"T22-HLOOKUP(X22,#REF!,4,FALSE)","v":{"$error":"#REF!"}},{"$f":"T22-HLOOKUP(X22,#REF!,5,FALSE)","v":{"$error":"#REF!"}},{"$f":"T22-HLOOKUP(X22,#REF!,6,FALSE)","v":{"$error":"#REF!"}},{"$f":"T22-HLOOKUP(X22,#REF!,7,FALSE)","v":{"$error":"#REF!"}},{"$f":"T22-HLOOKUP(X22,#REF!,8,FALSE)","v":{"$error":"#REF!"}},{"$f":"T22-HLOOKUP(X22,#REF!,9,FALSE)","v":{"$error":"#REF!"}},null,null,null,null,null,null,null,{"$error":"#REF!"}]
["H","NE","ALS",18,377282,"ALLAIN","ARSENE",2003,31.62,"ASPTT Strasbourg","F",17,19,20,39,23,25,26,51,90,246.08063417223934,58.379999999999995,null,{"$f":"IF(A23=\"F\",(IF(OR(H23>2001,H23<2004),VLOOKUP(I23,Feuil1!$G$11:$H$25,2))),IF(A23=\"H\",(IF(OR(H23>2001,H23<2004),VLOOKUP(I23,Feuil1!$A$11:$F$29,2)))))","v":"M40"},null,{"$f":"T23-HLOOKUP(X23,#REF!,2,FALSE)","v":{"$error":"#REF!"}},{"$f":"T23-HLOOKUP(X23,#REF!,3,FALSE)","v":{"$error":"#REF!"}},{"$f":"T23-HLOOKUP(X23,#REF!,4,FALSE)","v":{"$error":"#REF!"}},{"$f":"T23-HLOOKUP(X23,#REF!,5,FALSE)","v":{"$error":"#REF!"}},{"$f":"T23-HLOOKUP(X23,#REF!,6,FALSE)","v":{"$error":"#REF!"}},{"$f":"T23-HLOOKUP(X23,#REF!,7,FALSE)","v":{"$error":"#REF!"}},{"$f":"T23-HLOOKUP(X23,#REF!,8,FALSE)","v":{"$error":"#REF!"}},{"$f":"T23-HLOOKUP(X23,#REF!,9,FALSE)","v":{"$error":"#REF!"}},null,null,null,null,null,null,null,{"$error":"#REF!"}]
["H","NORD","NPC",19,386699,"ROEGIERS","Jérôme",2003,35.4,"CHCD COMINES","F",15,17,19,36,22,24,26,50,86,206.75986177997467,50.6,null,{"$f":"IF(A24=\"F\",(IF(OR(H24>2001,H24<2004),VLOOKUP(I24,Feuil1!$G$11:$H$25,2))),IF(A24=\"H\",(IF(OR(H24>2001,H24<2004),VLOOKUP(I24,Feuil1!$A$11:$F$29,2)))))","v":"M40"},null,{"$f":"T24-HLOOKUP(X24,#REF!,2,FALSE)","v":{"$error":"#REF!"}},{"$f":"T24-HLOOKUP(X24,#REF!,3,FALSE)","v":{"$error":"#REF!"}},{"$f":"T24-HLOOKUP(X24,#REF!,4,FALSE)","v":{"$error":"#REF!"}},{"$f":"T24-HLOOKUP(X24,#REF!,5,FALSE)","v":{"$error":"#REF!"}},{"$f":"T24-HLOOKUP(X24,#REF!,6,FALSE)","v":{"$error":"#REF!"}},{"$f":"T24-HLOOKUP(X24,#REF!,7,FALSE)","v":{"$error":"#REF!"}},{"$f":"T24-HLOOKUP(X24,#REF!,8,FALSE)","v":{"$error":"#REF!"}},{"$f":"T24-HLOOKUP(X24,#REF!,9,FALSE)","v":{"$error":"#REF!"}},null,null,null,null,null,null,null,{"$error":"#REF!"}]
["H","NE","FCO",20,370381,"AYDOGDU","Yilmaz",2003,30.2,"LF Besançon","F",17,19,-20,36,22,24,-26,46,82,236.85075997693494,51.8,null,{"$f":"IF(A25=\"F\",(IF(OR(H25>2001,H25<2004),VLOOKUP(I25,Feuil1!$G$11:$H$25,2))),IF(A25=\"H\",(IF(OR(H25>2001,H25<2004),VLOOKUP(I25,Feuil1!$A$11:$F$29,2)))))","v":"M40"},null,{"$f":"T25-HLOOKUP(X25,#REF!,2,FALSE)","v":{"$error":"#REF!"}},{"$f":"T25-HLOOKUP(X25,#REF!,3,FALSE)","v":{"$error":"#REF!"}},{"$f":"T25-HLOOKUP(X25,#REF!,4,FALSE)","v":{"$error":"#REF!"}},{"$f":"T25-HLOOKUP(X25,#REF!,5,FALSE)","v":{"$error":"#REF!"}},{"$f":"T25-HLOOKUP(X25,#REF!,6,FALSE)","v":{"$error":"#REF!"}},{"$f":"T25-HLOOKUP(X25,#REF!,7,FALSE)","v":{"$error":"#REF!"}},{"$f":"T25-HLOOKUP(X25,#REF!,8,FALSE)","v":{"$error":"#REF!"}},{"$f":"T25-HLOOKUP(X25,#REF!,9,FALSE)","v":{"$error":"#REF!"}},null,null,null,null,null,null,null,{"$error":"#REF!"}]
["H","SEST","RAL",21,357869,"BARBIER","Jocelyn",2003,39.5,"Vaulx en Velin","F",15,17,19,36,20,22,24,46,82,175.47569552905856,42.5,null,{"$f":"IF(A26=\"F\",(IF(OR(H26>2001,H26<2004),VLOOKUP(I26,Feuil1!$G$11:$H$25,2))),IF(A26=\"H\",(IF(OR(H26>2001,H26<2004),VLOOKUP(I26,Feuil1!$A$11:$F$29,2)))))","v":"M40"},null,{"$f":"T26-HLOOKUP(X26,#REF!,2,FALSE)","v":{"$error":"#REF!"}},{"$f":"T26-HLOOKUP(X26,#REF!,3,FALSE)","v":{"$error":"#REF!"}},{"$f":"T26-HLOOKUP(X26,#REF!,4,FALSE)","v":{"$error":"#REF!"}},{"$f":"T26-HLOOKUP(X26,#REF!,5,FALSE)","v":{"$error":"#REF!"}},{"$f":"T26-HLOOKUP(X26,#REF!,6,FALSE)","v":{"$error":"#REF!"}},{"$f":"T26-HLOOKUP(X26,#REF!,7,FALSE)","v":{"$error":"#REF!"}},{"$f":"T26-HLOOKUP(X26,#REF!,8,FALSE)","v":{"$error":"#REF!"}},{"$f":"T26-HLOOKUP(X26,#REF!,9,FALSE)","v":{"$error":"#REF!"}},null,null,null,null,null,null,null,{"$error":"#REF!"}]
["H","ZCO","CEN",22,375839,"DALLIER","Dévy",2002,35.4,"CHM CHATEAUROUX","F",15,16,18,34,21,22,22,44,78,187.52638626555841,42.6,null,{"$f":"IF(A27=\"F\",(IF(OR(H27>2001,H27<2004),VLOOKUP(I27,Feuil1!$G$11:$H$25,2))),IF(A27=\"H\",(IF(OR(H27>2001,H27<2004),VLOOKUP(I27,Feuil1!$A$11:$F$29,2)))))","v":"M40"},null,{"$f":"T27-HLOOKUP(X27,#REF!,2,FALSE)","v":{"$error":"#REF!"}},{"$f":"T27-HLOOKUP(X27,#REF!,3,FALSE)","v":{"$error":"#REF!"}},{"$f":"T27-HLOOKUP(X27,#REF!,4,FALSE)","v":{"$error":"#REF!"}},{"$f":"T27-HLOOKUP(X27,#REF!,5,FALSE)","v":{"$error":"#REF!"}},{"$f":"T27-HLOOKUP(X27,#REF!,6,FALSE)","v":{"$error":"#REF!"}},{"$f":"T27-HLOOKUP(X27,#REF!,7,FALSE)","v":{"$error":"#REF!"}},{"$f":"T27-HLOOKUP(X27,#REF!,8,FALSE)","v":{"$error":"#REF!"}},{"$f":"T27-HLOOKUP(X27,#REF!,9,FALSE)","v":{"$error":"#REF!"}},null,null,null,null,null,null,null,{"$error":"#REF!"}]
["H","SO","POI",23,384574,"FERNANDES","Hugo",2003,39,"ST-JEAN D'ANGÉLY","F",16,18,20,38,18,-20,20,38,76,164.78197019299679,37,null,{"$f":"IF(A28=\"F\",(IF(OR(H28>2001,H28<2004),VLOOKUP(I28,Feuil1!$G$11:$H$25,2))),IF(A28=\"H\",(IF(OR(H28>2001,H28<2004),VLOOKUP(I28,Feuil1!$A$11:$F$29,2)))))","v":"M40"},null,{"$f":"T28-HLOOKUP(X28,#REF!,2,FALSE)","v":{"$error":"#REF!"}},{"$f":"T28-HLOOKUP(X28,#REF!,3,FALSE)","v":{"$error":"#REF!"}},{"$f":"T28-HLOOKUP(X28,#REF!,4,FALSE)","v":{"$error":"#REF!"}},{"$f":"T28-HLOOKUP(X28,#REF!,5,FALSE)","v":{"$error":"#REF!"}},{"$f":"T28-HLOOKUP(X28,#REF!,6,FALSE)","v":{"$error":"#REF!"}},{"$f":"T28-HLOOKUP(X28,#REF!,7,FALSE)","v":{"$error":"#REF!"}},{"$f":"T28-HLOOKUP(X28,#REF!,8,FALSE)","v":{"$error":"#REF!"}},{"$f":"T28-HLOOKUP(X28,#REF!,9,FALSE)","v":{"$error":"#REF!"}},null,null,null,null,null,null,null,{"$error":"#REF!"}]
["H","NORD","NPC",24,359629,"ETCHEVERRY","Antoine",2003,26,"C.A.ROSENDAEL","F",14,-16,16,30,19,21,23,44,74,258.1860033421508,48,null,{"$f":"IF(A29=\"F\",(IF(OR(H29>2001,H29<2004),VLOOKUP(I29,Feuil1!$G$11:$H$25,2))),IF(A29=\"H\",(IF(OR(H29>2001,H29<2004),VLOOKUP(I29,Feuil1!$A$11:$F$29,2)))))","v":"M40"},null,{"$f":"T29-HLOOKUP(X29,#REF!,2,FALSE)","v":{"$error":"#REF!"}},{"$f":"T29-HLOOKUP(X29,#REF!,3,FALSE)","v":{"$error":"#REF!"}},{"$f":"T29-HLOOKUP(X29,#REF!,4,FALSE)","v":{"$error":"#REF!"}},{"$f":"T29-HLOOKUP(X29,#REF!,5,FALSE)","v":{"$error":"#REF!"}},{"$f":"T29-HLOOKUP(X29,#REF!,6,FALSE)","v":{"$error":"#REF!"}},{"$f":"T29-HLOOKUP(X29,#REF!,7,FALSE)","v":{"$error":"#REF!"}},{"$f":"T29-HLOOKUP(X29,#REF!,8,FALSE)","v":{"$error":"#REF!"}},{"$f":"T29-HLOOKUP(X29,#REF!,9,FALSE)","v":{"$error":"#REF!"}},null,null,null,null,null,null,null,{"$error":"#REF!"}]
["H","NE","BOU",25,365945,"MAZON","Alexis",2002,27.48,"HC saint honoré les bains","F",15,17,-19,32,17,19,21,40,72,233.84054353402925,44.519999999999996,null,{"$f":"IF(A30=\"F\",(IF(OR(H30>2001,H30<2004),VLOOKUP(I30,Feuil1!$G$11:$H$25,2))),IF(A30=\"H\",(IF(OR(H30>2001,H30<2004),VLOOKUP(I30,Feuil1!$A$11:$F$29,2)))))","v":"M40"},null,{"$f":"T30-HLOOKUP(X30,#REF!,2,FALSE)","v":{"$error":"#REF!"}},{"$f":"T30-HLOOKUP(X30,#REF!,3,FALSE)","v":{"$error":"#REF!"}},{"$f":"T30-HLOOKUP(X30,#REF!,4,FALSE)","v":{"$error":"#REF!"}},{"$f":"T30-HLOOKUP(X30,#REF!,5,FALSE)","v":{"$error":"#REF!"}},{"$f":"T30-HLOOKUP(X30,#REF!,6,FALSE)","v":{"$error":"#REF!"}},{"$f":"T30-HLOOKUP(X30,#REF!,7,FALSE)","v":{"$error":"#REF!"}},{"$f":"T30-HLOOKUP(X30,#REF!,8,FALSE)","v":{"$error":"#REF!"}},{"$f":"T30-HLOOKUP(X30,#REF!,9,FALSE)","v":{"$error":"#REF!"}},null,null,null,null,null,null,null,{"$error":"#REF!"}]
["H","NE","CHA",26," 376655","GUSTIN","Isario",2003,34.6,"Reims HM","F",10,12,14,26,16,18,20,38,64,157.81496077749742,29.4,null,{"$f":"IF(A31=\"F\",(IF(OR(H31>2001,H31<2004),VLOOKUP(I31,Feuil1!$G$11:$H$25,2))),IF(A31=\"H\",(IF(OR(H31>2001,H31<2004),VLOOKUP(I31,Feuil1!$A$11:$F$29,2)))))","v":"M40"},null,{"$f":"T31-HLOOKUP(X31,#REF!,2,FALSE)","v":{"$error":"#REF!"}},{"$f":"T31-HLOOKUP(X31,#REF!,3,FALSE)","v":{"$error":"#REF!"}},{"$f":"T31-HLOOKUP(X31,#REF!,4,FALSE)","v":{"$error":"#REF!"}},{"$f":"T31-HLOOKUP(X31,#REF!,5,FALSE)","v":{"$error":"#REF!"}},{"$f":"T31-HLOOKUP(X31,#REF!,6,FALSE)","v":{"$error":"#REF!"}},{"$f":"T31-HLOOKUP(X31,#REF!,7,FALSE)","v":{"$error":"#REF!"}},{"$f":"T31-HLOOKUP(X31,#REF!,8,FALSE)","v":{"$error":"#REF!"}},{"$f":"T31-HLOOKUP(X31,#REF!,9,FALSE)","v":{"$error":"#REF!"}},null,null,null,null,null,null,null,{"$error":"#REF!"}]
["H","SO","MPY",27,378624,"MELIA","Maxence",2002,39.799999999999997,"FIGEAC HC","F",10,12,13,25,16,18,20,38,63,133.77821276885618,23.200000000000003,null,{"$f":"IF(A32=\"F\",(IF(OR(H32>2001,H32<2004),VLOOKUP(I32,Feuil1!$G$11:$H$25,2))),IF(A32=\"H\",(IF(OR(H32>2001,H32<2004),VLOOKUP(I32,Feuil1!$A$11:$F$29,2)))))","v":"M40"},null,{"$f":"T32-HLOOKUP(X32,#REF!,2,FALSE)","v":{"$error":"#REF!"}},{"$f":"T32-HLOOKUP(X32,#REF!,3,FALSE)","v":{"$error":"#REF!"}},{"$f":"T32-HLOOKUP(X32,#REF!,4,FALSE)","v":{"$error":"#REF!"}},{"$f":"T32-HLOOKUP(X32,#REF!,5,FALSE)","v":{"$error":"#REF!"}},{"$f":"T32-HLOOKUP(X32,#REF!,6,FALSE)","v":{"$error":"#REF!"}},{"$f":"T32-HLOOKUP(X32,#REF!,7,FALSE)","v":{"$error":"#REF!"}},{"$f":"T32-HLOOKUP(X32,#REF!,8,FALSE)","v":{"$error":"#REF!"}},{"$f":"T32-HLOOKUP(X32,#REF!,9,FALSE)","v":{"$error":"#REF!"}},null,null,null,null,null,null,null,{"$error":"#REF!"}]
["H","SEST","LAN",28,378498,"CAYROL","Jimmy",2003,35.200000000000003,"Frontignan AC","F",10,12,14,26,15,17,19,36,62,149.99317487342253,26.799999999999997,null,{"$f":"IF(A33=\"F\",(IF(OR(H33>2001,H33<2004),VLOOKUP(I33,Feuil1!$G$11:$H$25,2))),IF(A33=\"H\",(IF(OR(H33>2001,H33<2004),VLOOKUP(I33,Feuil1!$A$11:$F$29,2)))))","v":"M40"},null,{"$f":"T33-HLOOKUP(X33,#REF!,2,FALSE)","v":{"$error":"#REF!"}},{"$f":"T33-HLOOKUP(X33,#REF!,3,FALSE)","v":{"$error":"#REF!"}},{"$f":"T33-HLOOKUP(X33,#REF!,4,FALSE)","v":{"$error":"#REF!"}},{"$f":"T33-HLOOKUP(X33,#REF!,5,FALSE)","v":{"$error":"#REF!"}},{"$f":"T33-HLOOKUP(X33,#REF!,6,FALSE)","v":{"$error":"#REF!"}},{"$f":"T33-HLOOKUP(X33,#REF!,7,FALSE)","v":{"$error":"#REF!"}},{"$f":"T33-HLOOKUP(X33,#REF!,8,FALSE)","v":{"$error":"#REF!"}},{"$f":"T33-HLOOKUP(X33,#REF!,9,FALSE)","v":{"$error":"#REF!"}},null,null,null,null,null,null,null,{"$error":"#REF!"}]
["H","NE","CHA",29," 376654","GUSTIN","Ophelio",2002,32.200000000000003,"Reims HM","F",10,12,-14,22,16,18,20,38,60,160.59626319202229,27.799999999999997,null,{"$f":"IF(A34=\"F\",(IF(OR(H34>2001,H34<2004),VLOOKUP(I34,Feuil1!$G$11:$H$25,2))),IF(A34=\"H\",(IF(OR(H34>2001,H34<2004),VLOOKUP(I34,Feuil1!$A$11:$F$29,2)))))","v":"M40"},null,{"$f":"T34-HLOOKUP(X34,#REF!,2,FALSE)","v":{"$error":"#REF!"}},{"$f":"T34-HLOOKUP(X34,#REF!,3,FALSE)","v":{"$error":"#REF!"}},{"$f":"T34-HLOOKUP(X34,#REF!,4,FALSE)","v":{"$error":"#REF!"}},{"$f":"T34-HLOOKUP(X34,#REF!,5,FALSE)","v":{"$error":"#REF!"}},{"$f":"T34-HLOOKUP(X34,#REF!,6,FALSE)","v":{"$error":"#REF!"}},{"$f":"T34-HLOOKUP(X34,#REF!,7,FALSE)","v":{"$error":"#REF!"}},{"$f":"T34-HLOOKUP(X34,#REF!,8,FALSE)","v":{"$error":"#REF!"}},{"$f":"T34-HLOOKUP(X34,#REF!,9,FALSE)","v":{"$error":"#REF!"}},null,null,null,null,null,null,null,{"$error":"#REF!"}]
["H","SO","AQU",30,396104,"FERRUA","PAUL",2003,32.85,"SAINT MEDARD","F",11,12,13,25,16,17,18,35,60,156.92005901861006,27.15,null,{"$f":"IF(A35=\"F\",(IF(OR(H35>2001,H35<2004),VLOOKUP(I35,Feuil1!$G$11:$H$25,2))),IF(A35=\"H\",(IF(OR(H35>2001,H35<2004),VLOOKUP(I35,Feuil1!$A$11:$F$29,2)))))","v":"M40"},null,{"$f":"T35-HLOOKUP(X35,#REF!,2,FALSE)","v":{"$error":"#REF!"}},{"$f":"T35-HLOOKUP(X35,#REF!,3,FALSE)","v":{"$error":"#REF!"}},{"$f":"T35-HLOOKUP(X35,#REF!,4,FALSE)","v":{"$error":"#REF!"}},{"$f":"T35-HLOOKUP(X35,#REF!,5,FALSE)","v":{"$error":"#REF!"}},{"$f":"T35-HLOOKUP(X35,#REF!,6,FALSE)","v":{"$error":"#REF!"}},{"$f":"T35-HLOOKUP(X35,#REF!,7,FALSE)","v":{"$error":"#REF!"}},{"$f":"T35-HLOOKUP(X35,#REF!,8,FALSE)","v":{"$error":"#REF!"}},{"$f":"T35-HLOOKUP(X35,#REF!,9,FALSE)","v":{"$error":"#REF!"}},null,null,null,null,null,null,null,{"$error":"#REF!"}]
["H","SEST","CAZ",31,391440,"BATHILY","Léo",2002,35.799999999999997,"ES VILLENEUVE LOUBET","F",12,14,16,30,12,14,16,30,60,142.48498430559584,24.200000000000003,null,{"$f":"IF(A36=\"F\",(IF(OR(H36>2001,H36<2004),VLOOKUP(I36,Feuil1!$G$11:$H$25,2))),IF(A36=\"H\",(IF(OR(H36>2001,H36<2004),VLOOKUP(I36,Feuil1!$A$11:$F$29,2)))))","v":"M40"},null,{"$f":"T36-HLOOKUP(X36,#REF!,2,FALSE)","v":{"$error":"#REF!"}},{"$f":"T36-HLOOKUP(X36,#REF!,3,FALSE)","v":{"$error":"#REF!"}},{"$f":"T36-HLOOKUP(X36,#REF!,4,FALSE)","v":{"$error":"#REF!"}},{"$f":"T36-HLOOKUP(X36,#REF!,5,FALSE)","v":{"$error":"#REF!"}},{"$f":"T36-HLOOKUP(X36,#REF!,6,FALSE)","v":{"$error":"#REF!"}},{"$f":"T36-HLOOKUP(X36,#REF!,7,FALSE)","v":{"$error":"#REF!"}},{"$f":"T36-HLOOKUP(X36,#REF!,8,FALSE)","v":{"$error":"#REF!"}},{"$f":"T36-HLOOKUP(X36,#REF!,9,FALSE)","v":{"$error":"#REF!"}},null,null,null,null,null,null,null,{"$error":"#REF!"}]
["H","NE","CHA",32,387908,"CHAMARANDE","Johanny",2002,39.4,"Langres HM","F",10,12,14,26,14,16,18,34,60,128.73104768121976,20.6,null,{"$f":"IF(A37=\"F\",(IF(OR(H37>2001,H37<2004),VLOOKUP(I37,Feuil1!$G$11:$H$25,2))),IF(A37=\"H\",(IF(OR(H37>2001,H37<2004),VLOOKUP(I37,Feuil1!$A$11:$F$29,2)))))","v":"M40"},null,{"$f":"T37-HLOOKUP(X37,#REF!,2,FALSE)","v":{"$error":"#REF!"}},{"$f":"T37-HLOOKUP(X37,#REF!,3,FALSE)","v":{"$error":"#REF!"}},{"$f":"T37-HLOOKUP(X37,#REF!,4,FALSE)","v":{"$error":"#REF!"}},{"$f":"T37-HLOOKUP(X37,#REF!,5,FALSE)","v":{"$error":"#REF!"}},{"$f":"T37-HLOOKUP(X37,#REF!,6,FALSE)","v":{"$error":"#REF!"}},{"$f":"T37-HLOOKUP(X37,#REF!,7,FALSE)","v":{"$error":"#REF!"}},{"$f":"T37-HLOOKUP(X37,#REF!,8,FALSE)","v":{"$error":"#REF!"}},{"$f":"T37-HLOOKUP(X37,#REF!,9,FALSE)","v":{"$error":"#REF!"}},null,null,null,null,null,null,null,{"$error":"#REF!"}]
["H","SEST","PRO",33,379241,"LABBE","Andy",2002,35,"EEAR MONTEUX","F",10,12,14,26,13,15,17,32,58,141.20334432679806,23,null,{"$f":"IF(A38=\"F\",(IF(OR(H38>2001,H38<2004),VLOOKUP(I38,Feuil1!$G$11:$H$25,2))),IF(A38=\"H\",(IF(OR(H38>2001,H38<2004),VLOOKUP(I38,Feuil1!$A$11:$F$29,2)))))","v":"M40"},null,{"$f":"T38-HLOOKUP(X38,#REF!,2,FALSE)","v":{"$error":"#REF!"}},{"$f":"T38-HLOOKUP(X38,#REF!,3,FALSE)","v":{"$error":"#REF!"}},{"$f":"T38-HLOOKUP(X38,#REF!,4,FALSE)","v":{"$error":"#REF!"}},{"$f":"T38-HLOOKUP(X38,#REF!,5,FALSE)","v":{"$error":"#REF!"}},{"$f":"T38-HLOOKUP(X38,#REF!,6,FALSE)","v":{"$error":"#REF!"}},{"$f":"T38-HLOOKUP(X38,#REF!,7,FALSE)","v":{"$error":"#REF!"}},{"$f":"T38-HLOOKUP(X38,#REF!,8,FALSE)","v":{"$error":"#REF!"}},{"$f":"T38-HLOOKUP(X38,#REF!,9,FALSE)","v":{"$error":"#REF!"}},null,null,null,null,null,null,null,{"$error":"#REF!"}]
["H","ZCO","CEN",34,375840,"FOUCHER","Paul",2002,33.6,"CHM CHATEAUROUX","F",11,12,12,24,16,17,-18,33,57,145.27343054184792,23.4,null,{"$f":"IF(A39=\"F\",(IF(OR(H39>2001,H39<2004),VLOOKUP(I39,Feuil1!$G$11:$H$25,2))),IF(A39=\"H\",(IF(OR(H39>2001,H39<2004),VLOOKUP(I39,Feuil1!$A$11:$F$29,2)))))","v":"M40"},null,{"$f":"T39-HLOOKUP(X39,#REF!,2,FALSE)","v":{"$error":"#REF!"}},{"$f":"T39-HLOOKUP(X39,#REF!,3,FALSE)","v":{"$error":"#REF!"}},{"$f":"T39-HLOOKUP(X39,#REF!,4,FALSE)","v":{"$error":"#REF!"}},{"$f":"T39-HLOOKUP(X39,#REF!,5,FALSE)","v":{"$error":"#REF!"}},{"$f":"T39-HLOOKUP(X39,#REF!,6,FALSE)","v":{"$error":"#REF!"}},{"$f":"T39-HLOOKUP(X39,#REF!,7,FALSE)","v":{"$error":"#REF!"}},{"$f":"T39-HLOOKUP(X39,#REF!,8,FALSE)","v":{"$error":"#REF!"}},{"$f":"T39-HLOOKUP(X39,#REF!,9,FALSE)","v":{"$error":"#REF!"}},null,null,null,null,null,null,null,{"$error":"#REF!"}]
["H","SEST","RAL",35,377618,"GRASPERGE","Amory",2002,37.700000000000003,"Vaulx en Velin","F",-7,7,-8,7,24,-26,26,50,57,128.04370004136726,19.299999999999997,null,{"$f":"IF(A40=\"F\",(IF(OR(H40>2001,H40<2004),VLOOKUP(I40,Feuil1!$G$11:$H$25,2))),IF(A40=\"H\",(IF(OR(H40>2001,H40<2004),VLOOKUP(I40,Feuil1!$A$11:$F$29,2)))))","v":"M40"},null,{"$f":"T40-HLOOKUP(X40,#REF!,2,FALSE)","v":{"$error":"#REF!"}},{"$f":"T40-HLOOKUP(X40,#REF!,3,FALSE)","v":{"$error":"#REF!"}},{"$f":"T40-HLOOKUP(X40,#REF!,4,FALSE)","v":{"$error":"#REF!"}},{"$f":"T40-HLOOKUP(X40,#REF!,5,FALSE)","v":{"$error":"#REF!"}},{"$f":"T40-HLOOKUP(X40,#REF!,6,FALSE)","v":{"$error":"#REF!"}},{"$f":"T40-HLOOKUP(X40,#REF!,7,FALSE)","v":{"$error":"#REF!"}},{"$f":"T40-HLOOKUP(X40,#REF!,8,FALSE)","v":{"$error":"#REF!"}},{"$f":"T40-HLOOKUP(X40,#REF!,9,FALSE)","v":{"$error":"#REF!"}},null,null,null,null,null,null,null,{"$error":"#REF!"}]
["H","CO","PDL",36,351830,"BEZIAS","guylian",2002,25.8,"ALSavenay","F",-7,7,8,15,8,9,10,19,34,119.83748971669419,8.1999999999999993,null,{"$f":"IF(A41=\"F\",(IF(OR(H41>2001,H41<2004),VLOOKUP(I41,Feuil1!$G$11:$H$25,2))),IF(A41=\"H\",(IF(OR(H41>2001,H41<2004),VLOOKUP(I41,Feuil1!$A$11:$F$29,2)))))","v":"M40"},null,{"$f":"T41-HLOOKUP(X41,#REF!,2,FALSE)","v":{"$error":"#REF!"}},{"$f":"T41-HLOOKUP(X41,#REF!,3,FALSE)","v":{"$error":"#REF!"}},{"$f":"T41-HLOOKUP(X41,#REF!,4,FALSE)","v":{"$error":"#REF!"}},{"$f":"T41-HLOOKUP(X41,#REF!,5,FALSE)","v":{"$error":"#REF!"}},{"$f":"T41-HLOOKUP(X41,#REF!,6,FALSE)","v":{"$error":"#REF!"}},{"$f":"T41-HLOOKUP(X41,#REF!,7,FALSE)","v":{"$error":"#REF!"}},{"$f":"T41-HLOOKUP(X41,#REF!,8,FALSE)","v":{"$error":"#REF!"}},{"$f":"T41-HLOOKUP(X41,#REF!,9,FALSE)","v":{"$error":"#REF!"}},null,null,null,null,null,null,null,{"$error":"#REF!"}]
[null,null,null,null,null,null,null,null,null,null,null,null,null,null,null,null,null,null,null,null,null,null,null,null,null,null," ",{"$f":"T42-HLOOKUP(X42,[1]Feuil1!$C$1:$BL$10,2,FALSE)","v":{"$error":"#N/A"}},{"$f":"T42-HLOOKUP(X42,[1]Feuil1!$C$1:$BL$10,3,FALSE)","v":{"$error":"#N/A"}},{"$f":"T42-HLOOKUP(X42,[1]Feuil1!$C$1:$BL$10,4,FALSE)","v":{"$error":"#N/A"}},{"$f":"T42-HLOOKUP(X42,[1]Feuil1!$C$1:$BL$10,5,FALSE)","v":{"$error":"#N/A"}},{"$f":"T42-HLOOKUP(X42,[1]Feuil1!$C$1:$BL$10,6,FALSE)","v":{"$error":"#N/A"}},{"$f":"T42-HLOOKUP(X42,[1]Feuil1!$C$1:$BL$10,7,FALSE)","v":{"$error":"#N/A"}},{"$f":"T42-HLOOKUP(X42,[1]Feuil1!$C$1:$BL$10,8,FALSE)","v":{"$error":"#N/A"}},{"$f":"T42-HLOOKUP(X42,[1]Feuil1!$C$1:$BL$10,9,FALSE)","v":{"$error":"#N/A"}},{"$f":"T42-HLOOKUP(X42,[1]Feuil1!$C$1:$BL$10,10,FALSE)","v":{"$error":"#N/A"}},null,null,null,null,null,null,{"$f":"IF(AJ42>=0,$AJ$4,IF(AI42>=0,$AI$4,IF(AH42>=0,$AH$4,IF(AG42>=0,$AG$4,IF(AF42>=0,$AF$4,IF(AE42>=0,$AE$4,IF(AD42>=0,$AD$4,IF(AC42>=0,$AC$4,$AB$4))))))))","v":{"$error":"#N/A"}}]
["H","CO","PDL",1,355921,"COGNON","Théo",2002,40.700000000000003,"CJF LAVAL - VOUTRÉ","F",37,39,41,{"$f":"IF(MAXA(L43+M43,M43+N43,L43+N43,L43,M43,N43)<=0,0,MAXA(L43+M43,M43+N43,L43+N43,L43,M43,N43))","v":80},46,48,50,{"$f":"IF(MAXA(P43+Q43,Q43+R43,P43+R43,P43,Q43,R43)<=0,0,MAXA(P43+Q43,Q43+R43,P43+R43,P43,Q43,R43))","v":98},{"$f":"IF(H43=\"\",\"\",IF(OR(O43=0,S43=0),0,O43+S43))","v":178},{"$f":"IF(I43=\"\",\"\",IF(A43=\"H\",10^(0.794358141*LOG(I43/174.393)^2)*T43,IF(A43=\"F\",10^(0.89726074 * LOG(I43/148.026)^2)*T43,\"\")))","v":369.5218175247258},{"$f":"SUM(T43-I43)","v":137.30000000000001},null,{"$f":"IF(A43=\"F\",(IF(OR(H43>2001,H43<2004),VLOOKUP(I43,Feuil1!$G$11:$H$25,2))),IF(A43=\"H\",(IF(OR(H43>2001,H43<2004),VLOOKUP(I43,Feuil1!$A$11:$F$29,2)))))","v":"M45"},null,{"$f":"T43-HLOOKUP(X43,#REF!,2,FALSE)","v":{"$error":"#REF!"}},{"$f":"T43-HLOOKUP(X43,#REF!,3,FALSE)","v":{"$error":"#REF!"}},{"$f":"T43-HLOOKUP(X43,#REF!,4,FALSE)","v":{"$error":"#REF!"}},{"$f":"T43-HLOOKUP(X43,#REF!,5,FALSE)","v":{"$error":"#REF!"}},{"$f":"T43-HLOOKUP(X43,#REF!,6,FALSE)","v":{"$error":"#REF!"}},{"$f":"T43-HLOOKUP(X43,#REF!,7,FALSE)","v":{"$error":"#REF!"}},{"$f":"T43-HLOOKUP(X43,#REF!,8,FALSE)","v":{"$error":"#REF!"}},{"$f":"T43-HLOOKUP(X43,#REF!,9,FALSE)","v":{"$error":"#REF!"}},null,null,null,null,null,null,null,{"$f":"IF(AG43>=0,$AG$4,IF(AF43>=0,$AF$4,IF(AE43>=0,$AE$4,IF(AD43>=0,$AD$4,IF(AC43>=0,$AC$4,IF(AB43>=0,$AB$4,IF(AA43>=0,$AA$4,IF(Z43>=0,$Z$4,$AH$4))))))))","v":{"$error":"#REF!"}}]
["H","SO","MPY",2,378627,"VALEAN","Andrei",2003,42.53,"FIGEAC HC","R",32,-34,34,66,38,40,42,82,148,294.1676504679894,105.47,null,{"$f":"IF(A44=\"F\",(IF(OR(H44>2001,H44<2004),VLOOKUP(I44,Feuil1!$G$11:$H$25,2))),IF(A44=\"H\",(IF(OR(H44>2001,H44<2004),VLOOKUP(I44,Feuil1!$A$11:$F$29,2)))))","v":"M45"},null,{"$f":"T44-HLOOKUP(X44,#REF!,2,FALSE)","v":{"$error":"#REF!"}},{"$f":"T44-HLOOKUP(X44,#REF!,3,FALSE)","v":{"$error":"#REF!"}},{"$f":"T44-HLOOKUP(X44,#REF!,4,FALSE)","v":{"$error":"#REF!"}},{"$f":"T44-HLOOKUP(X44,#REF!,5,FALSE)","v":{"$error":"#REF!"}},{"$f":"T44-HLOOKUP(X44,#REF!,6,FALSE)","v":{"$error":"#REF!"}},{"$f":"T44-HLOOKUP(X44,#REF!,7,FALSE)","v":{"$error":"#REF!"}},{"$f":"T44-HLOOKUP(X44,#REF!,8,FALSE)","v":{"$error":"#REF!"}},{"$f":"T44-HLOOKUP(X44,#REF!,9,FALSE)","v":{"$error":"#REF!"}},null,null,null,null,null,null,null,{"$error":"#REF!"}]
["H","SEST","PRO",3,344414,"MARTIN","Gabriel",2002,42.6,"EEAR MONTEUX","F",28,30,32,62,38,40,42,82,144,285.75952753693315,101.4,null,{"$f":"IF(A45=\"F\",(IF(OR(H45>2001,H45<2004),VLOOKUP(I45,Feuil1!$G$11:$H$25,2))),IF(A45=\"H\",(IF(OR(H45>2001,H45<2004),VLOOKUP(I45,Feuil1!$A$11:$F$29,2)))))","v":"M45"},null,{"$f":"T45-HLOOKUP(X45,#REF!,2,FALSE)","v":{"$error":"#REF!"}},{"$f":"T45-HLOOKUP(X45,#REF!,3,FALSE)","v":{"$error":"#REF!"}},{"$f":"T45-HLOOKUP(X45,#REF!,4,FALSE)","v":{"$error":"#REF!"}},{"$f":"T45-HLOOKUP(X45,#REF!,5,FALSE)","v":{"$error":"#REF!"}},{"$f":"T45-HLOOKUP(X45,#REF!,6,FALSE)","v":{"$error":"#REF!"}},{"$f":"T45-HLOOKUP(X45,#REF!,7,FALSE)","v":{"$error":"#REF!"}},{"$f":"T45-HLOOKUP(X45,#REF!,8,FALSE)","v":{"$error":"#REF!"}},{"$f":"T45-HLOOKUP(X45,#REF!,9,FALSE)","v":{"$error":"#REF!"}},null,null,null,null,null,null,null,{"$error":"#REF!"}]
["H","NORD","NPC",4,344407,"GALLOO","Martin",2002,44.07,"CHCD COMINES","F",29,31,-32,60,40,42,-44,82,142,272.75389343514581,97.93,null,{"$f":"IF(A46=\"F\",(IF(OR(H46>2001,H46<2004),VLOOKUP(I46,Feuil1!$G$11:$H$25,2))),IF(A46=\"H\",(IF(OR(H46>2001,H46<2004),VLOOKUP(I46,Feuil1!$A$11:$F$29,2)))))","v":"M45"},null,{"$f":"T46-HLOOKUP(X46,#REF!,2,FALSE)","v":{"$error":"#REF!"}},{"$f":"T46-HLOOKUP(X46,#REF!,3,FALSE)","v":{"$error":"#REF!"}},{"$f":"T46-HLOOKUP(X46,#REF!,4,FALSE)","v":{"$error":"#REF!"}},{"$f":"T46-HLOOKUP(X46,#REF!,5,FALSE)","v":{"$error":"#REF!"}},{"$f":"T46-HLOOKUP(X46,#REF!,6,FALSE)","v":{"$error":"#REF!"}},{"$f":"T46-HLOOKUP(X46,#REF!,7,FALSE)","v":{"$error":"#REF!"}},{"$f":"T46-HLOOKUP(X46,#REF!,8,FALSE)","v":{"$error":"#REF!"}},{"$f":"T46-HLOOKUP(X46,#REF!,9,FALSE)","v":{"$error":"#REF!"}},null,null,null,null,null,null,null,{"$error":"#REF!"}]
["H","NORD","NPC",5,383860,"BOULANGER","Geoffrey",2002,44.42,"A.O.SALLAUMINES","F",25,26,27,53,33,35,-37,68,121,230.68364396783329,76.58,null,{"$f":"IF(A47=\"F\",(IF(OR(H47>2001,H47<2004),VLOOKUP(I47,Feuil1!$G$11:$H$25,2))),IF(A47=\"H\",(IF(OR(H47>2001,H47<2004),VLOOKUP(I47,Feuil1!$A$11:$F$29,2)))))","v":"M45"},null,{"$f":"T47-HLOOKUP(X47,#REF!,2,FALSE)","v":{"$error":"#REF!"}},{"$f":"T47-HLOOKUP(X47,#REF!,3,FALSE)","v":{"$error":"#REF!"}},{"$f":"T47-HLOOKUP(X47,#REF!,4,FALSE)","v":{"$error":"#REF!"}},{"$f":"T47-HLOOKUP(X47,#REF!,5,FALSE)","v":{"$error":"#REF!"}},{"$f":"T47-HLOOKUP(X47,#REF!,6,FALSE)","v":{"$error":"#REF!"}},{"$f":"T47-HLOOKUP(X47,#REF!,7,FALSE)","v":{"$error":"#REF!"}},{"$f":"T47-HLOOKUP(X47,#REF!,8,FALSE)","v":{"$error":"#REF!"}},{"$f":"T47-HLOOKUP(X47,#REF!,9,FALSE)","v":{"$error":"#REF!"}},null,null,null,null,null,null,null,{"$error":"#REF!"}]
["H","SEST","LAN",6,367403,"TARUSSIO","Laurent",2003,42.8,"Narbonne Haltéro","F",22,24,-25,46,30,32,33,65,111,219.27357373462866,68.2,null,{"$f":"IF(A48=\"F\",(IF(OR(H48>2001,H48<2004),VLOOKUP(I48,Feuil1!$G$11:$H$25,2))),IF(A48=\"H\",(IF(OR(H48>2001,H48<2004),VLOOKUP(I48,Feuil1!$A$11:$F$29,2)))))","v":"M45"},null,{"$f":"T48-HLOOKUP(X48,#REF!,2,FALSE)","v":{"$error":"#REF!"}},{"$f":"T48-HLOOKUP(X48,#REF!,3,FALSE)","v":{"$error":"#REF!"}},{"$f":"T48-HLOOKUP(X48,#REF!,4,FALSE)","v":{"$error":"#REF!"}},{"$f":"T48-HLOOKUP(X48,#REF!,5,FALSE)","v":{"$error":"#REF!"}},{"$f":"T48-HLOOKUP(X48,#REF!,6,FALSE)","v":{"$error":"#REF!"}},{"$f":"T48-HLOOKUP(X48,#REF!,7,FALSE)","v":{"$error":"#REF!"}},{"$f":"T48-HLOOKUP(X48,#REF!,8,FALSE)","v":{"$error":"#REF!"}},{"$f":"T48-HLOOKUP(X48,#REF!,9,FALSE)","v":{"$error":"#REF!"}},null,null,null,null,null,null,null,{"$error":"#REF!"}]
["H","NE","BOU",7,358738,"MILOUD","Malik",2003,43.69,"HC Avallon","F",20,22,23,45,24,26,28,54,99,191.73373337212928,55.31,null,{"$f":"IF(A49=\"F\",(IF(OR(H49>2001,H49<2004),VLOOKUP(I49,Feuil1!$G$11:$H$25,2))),IF(A49=\"H\",(IF(OR(H49>2001,H49<2004),VLOOKUP(I49,Feuil1!$A$11:$F$29,2)))))","v":"M45"},null,{"$f":"T49-HLOOKUP(X49,#REF!,2,FALSE)","v":{"$error":"#REF!"}},{"$f":"T49-HLOOKUP(X49,#REF!,3,FALSE)","v":{"$error":"#REF!"}},{"$f":"T49-HLOOKUP(X49,#REF!,4,FALSE)","v":{"$error":"#REF!"}},{"$f":"T49-HLOOKUP(X49,#REF!,5,FALSE)","v":{"$error":"#REF!"}},{"$f":"T49-HLOOKUP(X49,#REF!,6,FALSE)","v":{"$error":"#REF!"}},{"$f":"T49-HLOOKUP(X49,#REF!,7,FALSE)","v":{"$error":"#REF!"}},{"$f":"T49-HLOOKUP(X49,#REF!,8,FALSE)","v":{"$error":"#REF!"}},{"$f":"T49-HLOOKUP(X49,#REF!,9,FALSE)","v":{"$error":"#REF!"}},null,null,null,null,null,null,null,{"$error":"#REF!"}]
["H","NORD","PIC",8,376821,"LEGER LESOT","Dylan",2002,43.28,"La Vaillante Saint Quentin","F",18,20,22,42,24,26,28,54,96,187.61114176571698,52.72,null,{"$f":"IF(A50=\"F\",(IF(OR(H50>2001,H50<2004),VLOOKUP(I50,Feuil1!$G$11:$H$25,2))),IF(A50=\"H\",(IF(OR(H50>2001,H50<2004),VLOOKUP(I50,Feuil1!$A$11:$F$29,2)))))","v":"M45"},null,{"$f":"T50-HLOOKUP(X50,#REF!,2,FALSE)","v":{"$error":"#REF!"}},{"$f":"T50-HLOOKUP(X50,#REF!,3,FALSE)","v":{"$error":"#REF!"}},{"$f":"T50-HLOOKUP(X50,#REF!,4,FALSE)","v":{"$error":"#REF!"}},{"$f":"T50-HLOOKUP(X50,#REF!,5,FALSE)","v":{"$error":"#REF!"}},{"$f":"T50-HLOOKUP(X50,#REF!,6,FALSE)","v":{"$error":"#REF!"}},{"$f":"T50-HLOOKUP(X50,#REF!,7,FALSE)","v":{"$error":"#REF!"}},{"$f":"T50-HLOOKUP(X50,#REF!,8,FALSE)","v":{"$error":"#REF!"}},{"$f":"T50-HLOOKUP(X50,#REF!,9,FALSE)","v":{"$error":"#REF!"}},null,null,null,null,null,null,null,{"$error":"#REF!"}]
["H","NORD","NPC",9,352093,"CABRE","Martin",2003,44.9,"ALSH BULLY LES MINES","F",17,19,21,40,25,27,29,56,96,181.18213042456608,51.1,null,{"$f":"IF(A51=\"F\",(IF(OR(H51>2001,H51<2004),VLOOKUP(I51,Feuil1!$G$11:$H$25,2))),IF(A51=\"H\",(IF(OR(H51>2001,H51<2004),VLOOKUP(I51,Feuil1!$A$11:$F$29,2)))))","v":"M45"},null,{"$f":"T51-HLOOKUP(X51,#REF!,2,FALSE)","v":{"$error":"#REF!"}},{"$f":"T51-HLOOKUP(X51,#REF!,3,FALSE)","v":{"$error":"#REF!"}},{"$f":"T51-HLOOKUP(X51,#REF!,4,FALSE)","v":{"$error":"#REF!"}},{"$f":"T51-HLOOKUP(X51,#REF!,5,FALSE)","v":{"$error":"#REF!"}},{"$f":"T51-HLOOKUP(X51,#REF!,6,FALSE)","v":{"$error":"#REF!"}},{"$f":"T51-HLOOKUP(X51,#REF!,7,FALSE)","v":{"$error":"#REF!"}},{"$f":"T51-HLOOKUP(X51,#REF!,8,FALSE)","v":{"$error":"#REF!"}},{"$f":"T51-HLOOKUP(X51,#REF!,9,FALSE)","v":{"$error":"#REF!"}},null,null,null,null,null,null,null,{"$error":"#REF!"}]
["H","SO","MPY",10,378624,"MELIA","Maxence",2002,42.59,"FIGEAC HC","F",18,20,-22,38,23,25,27,52,90,178.64048876441737,47.41,null,{"$f":"IF(A52=\"F\",(IF(OR(H52>2001,H52<2004),VLOOKUP(I52,Feuil1!$G$11:$H$25,2))),IF(A52=\"H\",(IF(OR(H52>2001,H52<2004),VLOOKUP(I52,Feuil1!$A$11:$F$29,2)))))","v":"M45"},null,{"$f":"T52-HLOOKUP(X52,#REF!,2,FALSE)","v":{"$error":"#REF!"}},{"$f":"T52-HLOOKUP(X52,#REF!,3,FALSE)","v":{"$error":"#REF!"}},{"$f":"T52-HLOOKUP(X52,#REF!,4,FALSE)","v":{"$error":"#REF!"}},{"$f":"T52-HLOOKUP(X52,#REF!,5,FALSE)","v":{"$error":"#REF!"}},{"$f":"T52-HLOOKUP(X52,#REF!,6,FALSE)","v":{"$error":"#REF!"}},{"$f":"T52-HLOOKUP(X52,#REF!,7,FALSE)","v":{"$error":"#REF!"}},{"$f":"T52-HLOOKUP(X52,#REF!,8,FALSE)","v":{"$error":"#REF!"}},{"$f":"T52-HLOOKUP(X52,#REF!,9,FALSE)","v":{"$error":"#REF!"}},null,null,null,null,null,null,null,{"$error":"#REF!"}]
["H","NORD","PIC",11,386580,"CREQUIS","Sullivan",2003,43.74,"Hirson CEHT","F",16,18,-20,34,25,27,29,56,90,174.11317409871606,46.26,null,{"$f":"IF(A53=\"F\",(IF(OR(H53>2001,H53<2004),VLOOKUP(I53,Feuil1!$G$11:$H$25,2))),IF(A53=\"H\",(IF(OR(H53>2001,H53<2004),VLOOKUP(I53,Feuil1!$A$11:$F$29,2)))))","v":"M45"},null,{"$f":"T53-HLOOKUP(X53,#REF!,2,FALSE)","v":{"$error":"#REF!"}},{"$f":"T53-HLOOKUP(X53,#REF!,3,FALSE)","v":{"$error":"#REF!"}},{"$f":"T53-HLOOKUP(X53,#REF!,4,FALSE)","v":{"$error":"#REF!"}},{"$f":"T53-HLOOKUP(X53,#REF!,5,FALSE)","v":{"$error":"#REF!"}},{"$f":"T53-HLOOKUP(X53,#REF!,6,FALSE)","v":{"$error":"#REF!"}},{"$f":"T53-HLOOKUP(X53,#REF!,7,FALSE)","v":{"$error":"#REF!"}},{"$f":"T53-HLOOKUP(X53,#REF!,8,FALSE)","v":{"$error":"#REF!"}},{"$f":"T53-HLOOKUP(X53,#REF!,9,FALSE)","v":{"$error":"#REF!"}},null,null,null,null,null,null,null,{"$error":"#REF!"}]
["H","SEST","CAZ",12,395173,"IPATOV","Daniel",2002,44.1,"ES VILLENEUVE LOUBET","R",16,18,20,38,23,25,27,52,90,172.76060008713435,45.9,null,{"$f":"IF(A54=\"F\",(IF(OR(H54>2001,H54<2004),VLOOKUP(I54,Feuil1!$G$11:$H$25,2))),IF(A54=\"H\",(IF(OR(H54>2001,H54<2004),VLOOKUP(I54,Feuil1!$A$11:$F$29,2)))))","v":"M45"},null,{"$f":"T54-HLOOKUP(X54,#REF!,2,FALSE)","v":{"$error":"#REF!"}},{"$f":"T54-HLOOKUP(X54,#REF!,3,FALSE)","v":{"$error":"#REF!"}},{"$f":"T54-HLOOKUP(X54,#REF!,4,FALSE)","v":{"$error":"#REF!"}},{"$f":"T54-HLOOKUP(X54,#REF!,5,FALSE)","v":{"$error":"#REF!"}},{"$f":"T54-HLOOKUP(X54,#REF!,6,FALSE)","v":{"$error":"#REF!"}},{"$f":"T54-HLOOKUP(X54,#REF!,7,FALSE)","v":{"$error":"#REF!"}},{"$f":"T54-HLOOKUP(X54,#REF!,8,FALSE)","v":{"$error":"#REF!"}},{"$f":"T54-HLOOKUP(X54,#REF!,9,FALSE)","v":{"$error":"#REF!"}},null,null,null,null,null,null,null,{"$error":"#REF!"}]
["H","NE","ALS",13,353650,"RIEHL","MATEO",2002,44,"Dorlisheim FH","F",18,20,-22,38,22,24,26,50,88,169.28593752442015,44,null,{"$f":"IF(A55=\"F\",(IF(OR(H55>2001,H55<2004),VLOOKUP(I55,Feuil1!$G$11:$H$25,2))),IF(A55=\"H\",(IF(OR(H55>2001,H55<2004),VLOOKUP(I55,Feuil1!$A$11:$F$29,2)))))","v":"M45"},null,{"$f":"T55-HLOOKUP(X55,#REF!,2,FALSE)","v":{"$error":"#REF!"}},{"$f":"T55-HLOOKUP(X55,#REF!,3,FALSE)","v":{"$error":"#REF!"}},{"$f":"T55-HLOOKUP(X55,#REF!,4,FALSE)","v":{"$error":"#REF!"}},{"$f":"T55-HLOOKUP(X55,#REF!,5,FALSE)","v":{"$error":"#REF!"}},{"$f":"T55-HLOOKUP(X55,#REF!,6,FALSE)","v":{"$error":"#REF!"}},{"$f":"T55-HLOOKUP(X55,#REF!,7,FALSE)","v":{"$error":"#REF!"}},{"$f":"T55-HLOOKUP(X55,#REF!,8,FALSE)","v":{"$error":"#REF!"}},{"$f":"T55-HLOOKUP(X55,#REF!,9,FALSE)","v":{"$error":"#REF!"}},null,null,null,null,null,null,null,{"$error":"#REF!"}]
["H","SEST","RAL",14,357869,"BARBIER","Jocelyn",2003,41.1,"Vaulx en Velin","F",16,18,20,38,20,22,24,46,84,172.68294502500899,42.9,null,{"$f":"IF(A56=\"F\",(IF(OR(H56>2001,H56<2004),VLOOKUP(I56,Feuil1!$G$11:$H$25,2))),IF(A56=\"H\",(IF(OR(H56>2001,H56<2004),VLOOKUP(I56,Feuil1!$A$11:$F$29,2)))))","v":"M45"},null,{"$f":"T56-HLOOKUP(X56,#REF!,2,FALSE)","v":{"$error":"#REF!"}},{"$f":"T56-HLOOKUP(X56,#REF!,3,FALSE)","v":{"$error":"#REF!"}},{"$f":"T56-HLOOKUP(X56,#REF!,4,FALSE)","v":{"$error":"#REF!"}},{"$f":"T56-HLOOKUP(X56,#REF!,5,FALSE)","v":{"$error":"#REF!"}},{"$f":"T56-HLOOKUP(X56,#REF!,6,FALSE)","v":{"$error":"#REF!"}},{"$f":"T56-HLOOKUP(X56,#REF!,7,FALSE)","v":{"$error":"#REF!"}},{"$f":"T56-HLOOKUP(X56,#REF!,8,FALSE)","v":{"$error":"#REF!"}},{"$f":"T56-HLOOKUP(X56,#REF!,9,FALSE)","v":{"$error":"#REF!"}},null,null,null,null,null,null,null,{"$error":"#REF!"}]
["H","ZCO","BRE",15,378685,"AUTRET ","Ian ",2003,44.54,"CHM Plouhinec","F",18,20,21,41,20,-22,22,42,83,157.83561856388226,38.46,null,{"$f":"IF(A57=\"F\",(IF(OR(H57>2001,H57<2004),VLOOKUP(I57,Feuil1!$G$11:$H$25,2))),IF(A57=\"H\",(IF(OR(H57>2001,H57<2004),VLOOKUP(I57,Feuil1!$A$11:$F$29,2)))))","v":"M45"},null,{"$f":"T57-HLOOKUP(X57,#REF!,2,FALSE)","v":{"$error":"#REF!"}},{"$f":"T57-HLOOKUP(X57,#REF!,3,FALSE)","v":{"$error":"#REF!"}},{"$f":"T57-HLOOKUP(X57,#REF!,4,FALSE)","v":{"$error":"#REF!"}},{"$f":"T57-HLOOKUP(X57,#REF!,5,FALSE)","v":{"$error":"#REF!"}},{"$f":"T57-HLOOKUP(X57,#REF!,6,FALSE)","v":{"$error":"#REF!"}},{"$f":"T57-HLOOKUP(X57,#REF!,7,FALSE)","v":{"$error":"#REF!"}},{"$f":"T57-HLOOKUP(X57,#REF!,8,FALSE)","v":{"$error":"#REF!"}},{"$f":"T57-HLOOKUP(X57,#REF!,9,FALSE)","v":{"$error":"#REF!"}},null,null,null,null,null,null,null,{"$error":"#REF!"}]
["H","NE","ALS",16,383774,"VERGNAUD","JAROD",2003,44.6,"SHC Haguenau","F",14,16,-17,30,20,22,23,45,75,142.44193491569689,30.4,null,{"$f":"IF(A58=\"F\",(IF(OR(H58>2001,H58<2004),VLOOKUP(I58,Feuil1!$G$11:$H$25,2))),IF(A58=\"H\",(IF(OR(H58>2001,H58<2004),VLOOKUP(I58,Feuil1!$A$11:$F$29,2)))))","v":"M45"},null,{"$f":"T58-HLOOKUP(X58,#REF!,2,FALSE)","v":{"$error":"#REF!"}},{"$f":"T58-HLOOKUP(X58,#REF!,3,FALSE)","v":{"$error":"#REF!"}},{"$f":"T58-HLOOKUP(X58,#REF!,4,FALSE)","v":{"$error":"#REF!"}},{"$f":"T58-HLOOKUP(X58,#REF!,5,FALSE)","v":{"$error":"#REF!"}},{"$f":"T58-HLOOKUP(X58,#REF!,6,FALSE)","v":{"$error":"#REF!"}},{"$f":"T58-HLOOKUP(X58,#REF!,7,FALSE)","v":{"$error":"#REF!"}},{"$f":"T58-HLOOKUP(X58,#REF!,8,FALSE)","v":{"$error":"#REF!"}},{"$f":"T58-HLOOKUP(X58,#REF!,9,FALSE)","v":{"$error":"#REF!"}},null,null,null,null,null,null,null,{"$error":"#REF!"}]
["H","SEST","RAL",17,372601,"VARDANIAN","Avetis",2003,42.2,"Vaulx en Velin","Arm",15,-16,16,31,18,20,22,42,73,146.20385816703154,30.799999999999997,null,{"$f":"IF(A59=\"F\",(IF(OR(H59>2001,H59<2004),VLOOKUP(I59,Feuil1!$G$11:$H$25,2))),IF(A59=\"H\",(IF(OR(H59>2001,H59<2004),VLOOKUP(I59,Feuil1!$A$11:$F$29,2)))))","v":"M45"},null,{"$f":"T59-HLOOKUP(X59,#REF!,2,FALSE)","v":{"$error":"#REF!"}},{"$f":"T59-HLOOKUP(X59,#REF!,3,FALSE)","v":{"$error":"#REF!"}},{"$f":"T59-HLOOKUP(X59,#REF!,4,FALSE)","v":{"$error":"#REF!"}},{"$f":"T59-HLOOKUP(X59,#REF!,5,FALSE)","v":{"$error":"#REF!"}},{"$f":"T59-HLOOKUP(X59,#REF!,6,FALSE)","v":{"$error":"#REF!"}},{"$f":"T59-HLOOKUP(X59,#REF!,7,FALSE)","v":{"$error":"#REF!"}},{"$f":"T59-HLOOKUP(X59,#REF!,8,FALSE)","v":{"$error":"#REF!"}},{"$f":"T59-HLOOKUP(X59,#REF!,9,FALSE)","v":{"$error":"#REF!"}},null,null,null,null,null,null,null,{"$error":"#REF!"}]
["H","NE","ALS",18,375935,"CIZEK","ERWAN",2002,43,"SHC Haguenau","F",15,-17,17,32,16,18,19,37,69,135.69168352303336,26,null,{"$f":"IF(A60=\"F\",(IF(OR(H60>2001,H60<2004),VLOOKUP(I60,Feuil1!$G$11:$H$25,2))),IF(A60=\"H\",(IF(OR(H60>2001,H60<2004),VLOOKUP(I60,Feuil1!$A$11:$F$29,2)))))","v":"M45"},null,{"$f":"T60-HLOOKUP(X60,#REF!,2,FALSE)","v":{"$error":"#REF!"}},{"$f":"T60-HLOOKUP(X60,#REF!,3,FALSE)","v":{"$error":"#REF!"}},{"$f":"T60-HLOOKUP(X60,#REF!,4,FALSE)","v":{"$error":"#REF!"}},{"$f":"T60-HLOOKUP(X60,#REF!,5,FALSE)","v":{"$error":"#REF!"}},{"$f":"T60-HLOOKUP(X60,#REF!,6,FALSE)","v":{"$error":"#REF!"}},{"$f":"T60-HLOOKUP(X60,#REF!,7,FALSE)","v":{"$error":"#REF!"}},{"$f":"T60-HLOOKUP(X60,#REF!,8,FALSE)","v":{"$error":"#REF!"}},{"$f":"T60-HLOOKUP(X60,#REF!,9,FALSE)","v":{"$error":"#REF!"}},null,null,null,null,null,null,null,{"$error":"#REF!"}]
["H","NE","BOU",19,395089,"CLEMENT","Etienne",2003,40.799999999999997,"Olympique Mâcon","F",10,12,14,26,15,17,19,36,62,128.39339875058019,21.200000000000003,null,{"$f":"IF(A61=\"F\",(IF(OR(H61>2001,H61<2004),VLOOKUP(I61,Feuil1!$G$11:$H$25,2))),IF(A61=\"H\",(IF(OR(H61>2001,H61<2004),VLOOKUP(I61,Feuil1!$A$11:$F$29,2)))))","v":"M45"},null,{"$f":"T61-HLOOKUP(X61,#REF!,2,FALSE)","v":{"$error":"#REF!"}},{"$f":"T61-HLOOKUP(X61,#REF!,3,FALSE)","v":{"$error":"#REF!"}},{"$f":"T61-HLOOKUP(X61,#REF!,4,FALSE)","v":{"$error":"#REF!"}},{"$f":"T61-HLOOKUP(X61,#REF!,5,FALSE)","v":{"$error":"#REF!"}},{"$f":"T61-HLOOKUP(X61,#REF!,6,FALSE)","v":{"$error":"#REF!"}},{"$f":"T61-HLOOKUP(X61,#REF!,7,FALSE)","v":{"$error":"#REF!"}},{"$f":"T61-HLOOKUP(X61,#REF!,8,FALSE)","v":{"$error":"#REF!"}},{"$f":"T61-HLOOKUP(X61,#REF!,9,FALSE)","v":{"$error":"#REF!"}},null,null,null,null,null,null,null,{"$error":"#REF!"}]
["H","CO","PDL",20,388362,"CORROY","Tahiri",2003,43.1,"CJF LAVAL - VOUTRÉ","F",12,-14,-14,12,12,14,15,29,41,80.447815234175451,-2.1000000000000014,null,{"$f":"IF(A62=\"F\",(IF(OR(H62>2001,H62<2004),VLOOKUP(I62,Feuil1!$G$11:$H$25,2))),IF(A62=\"H\",(IF(OR(H62>2001,H62<2004),VLOOKUP(I62,Feuil1!$A$11:$F$29,2)))))","v":"M45"},null,{"$f":"T62-HLOOKUP(X62,#REF!,2,FALSE)","v":{"$error":"#REF!"}},{"$f":"T62-HLOOKUP(X62,#REF!,3,FALSE)","v":{"$error":"#REF!"}},{"$f":"T62-HLOOKUP(X62,#REF!,4,FALSE)","v":{"$error":"#REF!"}},{"$f":"T62-HLOOKUP(X62,#REF!,5,FALSE)","v":{"$error":"#REF!"}},{"$f":"T62-HLOOKUP(X62,#REF!,6,FALSE)","v":{"$error":"#REF!"}},{"$f":"T62-HLOOKUP(X62,#REF!,7,FALSE)","v":{"$error":"#REF!"}},{"$f":"T62-HLOOKUP(X62,#REF!,8,FALSE)","v":{"$error":"#REF!"}},{"$f":"T62-HLOOKUP(X62,#REF!,9,FALSE)","v":{"$error":"#REF!"}},null,null,null,null,null,null,null,{"$error":"#REF!"}]
[null,null,null,null,null,null,null,null,null,null,null,null,null,null,null,null,null,null,null,null,null,null,null,null,null,null," ",{"$f":"T63-HLOOKUP(X63,[1]Feuil1!$C$1:$BL$10,2,FALSE)","v":{"$error":"#N/A"}},{"$f":"T63-HLOOKUP(X63,[1]Feuil1!$C$1:$BL$10,3,FALSE)","v":{"$error":"#N/A"}},{"$f":"T63-HLOOKUP(X63,[1]Feuil1!$C$1:$BL$10,4,FALSE)","v":{"$error":"#N/A"}},{"$f":"T63-HLOOKUP(X63,[1]Feuil1!$C$1:$BL$10,5,FALSE)","v":{"$error":"#N/A"}},{"$f":"T63-HLOOKUP(X63,[1]Feuil1!$C$1:$BL$10,6,FALSE)","v":{"$error":"#N/A"}},{"$f":"T63-HLOOKUP(X63,[1]Feuil1!$C$1:$BL$10,7,FALSE)","v":{"$error":"#N/A"}},{"$f":"T63-HLOOKUP(X63,[1]Feuil1!$C$1:$BL$10,8,FALSE)","v":{"$error":"#N/A"}},{"$f":"T63-HLOOKUP(X63,[1]Feuil1!$C$1:$BL$10,9,FALSE)","v":{"$error":"#N/A"}},{"$f":"T63-HLOOKUP(X63,[1]Feuil1!$C$1:$BL$10,10,FALSE)","v":{"$error":"#N/A"}},null,null,null,null,null,null,{"$f":"IF(AJ63>=0,$AJ$4,IF(AI63>=0,$AI$4,IF(AH63>=0,$AH$4,IF(AG63>=0,$AG$4,IF(AF63>=0,$AF$4,IF(AE63>=0,$AE$4,IF(AD63>=0,$AD$4,IF(AC63>=0,$AC$4,$AB$4))))))))","v":{"$error":"#N/A"}}]
["H","SEST","PRO",1,344414,"MARTIN","Gabriel",2002,47.2,"EEAR. MONTEUX","F",46,48,50,{"$f":"IF(MAXA(L64+M64,M64+N64,L64+N64,L64,M64,N64)<=0,0,MAXA(L64+M64,M64+N64,L64+N64,L64,M64,N64))","v":98},55,57,59,{"$f":"IF(MAXA(P64+Q64,Q64+R64,P64+R64,P64,Q64,R64)<=0,0,MAXA(P64+Q64,Q64+R64,P64+R64,P64,Q64,R64))","v":116},{"$f":"IF(H64=\"\",\"\",IF(OR(O64=0,S64=0),0,O64+S64))","v":214},{"$f":"IF(I64=\"\",\"\",IF(A64=\"H\",10^(0.794358141*LOG(I64/174.393)^2)*T64,IF(A64=\"F\",10^(0.89726074 * LOG(I64/148.026)^2)*T64,\"\")))","v":385.76273084719594},{"$f":"SUM(T64-I64)","v":166.8},null,{"$f":"IF(A64=\"F\",(IF(OR(H64>2001,H64<2004),VLOOKUP(I64,Feuil1!$G$11:$H$25,2))),IF(A64=\"H\",(IF(OR(H64>2001,H64<2004),VLOOKUP(I64,Feuil1!$A$11:$F$29,2)))))","v":"M50"},null,{"$f":"T64-HLOOKUP(X64,#REF!,2,FALSE)","v":{"$error":"#REF!"}},{"$f":"T64-HLOOKUP(X64,#REF!,3,FALSE)","v":{"$error":"#REF!"}},{"$f":"T64-HLOOKUP(X64,#REF!,4,FALSE)","v":{"$error":"#REF!"}},{"$f":"T64-HLOOKUP(X64,#REF!,5,FALSE)","v":{"$error":"#REF!"}},{"$f":"T64-HLOOKUP(X64,#REF!,6,FALSE)","v":{"$error":"#REF!"}},{"$f":"T64-HLOOKUP(X64,#REF!,7,FALSE)","v":{"$error":"#REF!"}},{"$f":"T64-HLOOKUP(X64,#REF!,8,FALSE)","v":{"$error":"#REF!"}},{"$f":"T64-HLOOKUP(X64,#REF!,9,FALSE)","v":{"$error":"#REF!"}},null,null,null,null,null,null,null,{"$f":"IF(AG64>=0,$AG$4,IF(AF64>=0,$AF$4,IF(AE64>=0,$AE$4,IF(AD64>=0,$AD$4,IF(AC64>=0,$AC$4,IF(AB64>=0,$AB$4,IF(AA64>=0,$AA$4,IF(Z64>=0,$Z$4,$AH$4))))))))","v":{"$error":"#REF!"}}]
["H","NE","ALS",2,324091,"SPAGNULO","GIACONO",2002,49.9,"SHC Haguenau",null,41,43,45,88,52,54,56,110,198,339.82137877802131,148.1,null,{"$f":"IF(A65=\"F\",(IF(OR(H65>2001,H65<2004),VLOOKUP(I65,Feuil1!$G$11:$H$25,2))),IF(A65=\"H\",(IF(OR(H65>2001,H65<2004),VLOOKUP(I65,Feuil1!$A$11:$F$29,2)))))","v":"M50"},null,{"$f":"T65-HLOOKUP(X65,#REF!,2,FALSE)","v":{"$error":"#REF!"}},{"$f":"T65-HLOOKUP(X65,#REF!,3,FALSE)","v":{"$error":"#REF!"}},{"$f":"T65-HLOOKUP(X65,#REF!,4,FALSE)","v":{"$error":"#REF!"}},{"$f":"T65-HLOOKUP(X65,#REF!,5,FALSE)","v":{"$error":"#REF!"}},{"$f":"T65-HLOOKUP(X65,#REF!,6,FALSE)","v":{"$error":"#REF!"}},{"$f":"T65-HLOOKUP(X65,#REF!,7,FALSE)","v":{"$error":"#REF!"}},{"$f":"T65-HLOOKUP(X65,#REF!,8,FALSE)","v":{"$error":"#REF!"}},{"$f":"T65-HLOOKUP(X65,#REF!,9,FALSE)","v":{"$error":"#REF!"}},null,null,null,null,null,null,null,{"$error":"#REF!"}]
["H","N","IDF",3,334661,"RASCLE","LENNY",2002,47.6,"SAINT MAUR","F",37,39,-41,76,44,46,48,94,170,304.13140524419333,122.4,null,{"$f":"IF(A66=\"F\",(IF(OR(H66>2001,H66<2004),VLOOKUP(I66,Feuil1!$G$11:$H$25,2))),IF(A66=\"H\",(IF(OR(H66>2001,H66<2004),VLOOKUP(I66,Feuil1!$A$11:$F$29,2)))))","v":"M50"},null,{"$f":"T66-HLOOKUP(X66,#REF!,2,FALSE)","v":{"$error":"#REF!"}},{"$f":"T66-HLOOKUP(X66,#REF!,3,FALSE)","v":{"$error":"#REF!"}},{"$f":"T66-HLOOKUP(X66,#REF!,4,FALSE)","v":{"$error":"#REF!"}},{"$f":"T66-HLOOKUP(X66,#REF!,5,FALSE)","v":{"$error":"#REF!"}},{"$f":"T66-HLOOKUP(X66,#REF!,6,FALSE)","v":{"$error":"#REF!"}},{"$f":"T66-HLOOKUP(X66,#REF!,7,FALSE)","v":{"$error":"#REF!"}},{"$f":"T66-HLOOKUP(X66,#REF!,8,FALSE)","v":{"$error":"#REF!"}},{"$f":"T66-HLOOKUP(X66,#REF!,9,FALSE)","v":{"$error":"#REF!"}},null,null,null,null,null,null,null,{"$error":"#REF!"}]
["H","SO","AQU",4,377643,"JACQUET","YOANN",2002,47.1,"BORDEAUX ASPOM","F",28,30,32,62,43,45,47,92,154,278.13680986379575,106.9,null,{"$f":"IF(A67=\"F\",(IF(OR(H67>2001,H67<2004),VLOOKUP(I67,Feuil1!$G$11:$H$25,2))),IF(A67=\"H\",(IF(OR(H67>2001,H67<2004),VLOOKUP(I67,Feuil1!$A$11:$F$29,2)))))","v":"M50"},null,{"$f":"T67-HLOOKUP(X67,#REF!,2,FALSE)","v":{"$error":"#REF!"}},{"$f":"T67-HLOOKUP(X67,#REF!,3,FALSE)","v":{"$error":"#REF!"}},{"$f":"T67-HLOOKUP(X67,#REF!,4,FALSE)","v":{"$error":"#REF!"}},{"$f":"T67-HLOOKUP(X67,#REF!,5,FALSE)","v":{"$error":"#REF!"}},{"$f":"T67-HLOOKUP(X67,#REF!,6,FALSE)","v":{"$error":"#REF!"}},{"$f":"T67-HLOOKUP(X67,#REF!,7,FALSE)","v":{"$error":"#REF!"}},{"$f":"T67-HLOOKUP(X67,#REF!,8,FALSE)","v":{"$error":"#REF!"}},{"$f":"T67-HLOOKUP(X67,#REF!,9,FALSE)","v":{"$error":"#REF!"}},null,null,null,null,null,null,null,{"$error":"#REF!"}]
["H","NORD","NPC",5,359647,"PARANTHOEN","Jason",2002,49,"C.A.ROSENDAEL","F",30,32,34,66,40,42,44,86,152,265.03490674454946,103,null,{"$f":"IF(A68=\"F\",(IF(OR(H68>2001,H68<2004),VLOOKUP(I68,Feuil1!$G$11:$H$25,2))),IF(A68=\"H\",(IF(OR(H68>2001,H68<2004),VLOOKUP(I68,Feuil1!$A$11:$F$29,2)))))","v":"M50"},null,{"$f":"T68-HLOOKUP(X68,#REF!,2,FALSE)","v":{"$error":"#REF!"}},{"$f":"T68-HLOOKUP(X68,#REF!,3,FALSE)","v":{"$error":"#REF!"}},{"$f":"T68-HLOOKUP(X68,#REF!,4,FALSE)","v":{"$error":"#REF!"}},{"$f":"T68-HLOOKUP(X68,#REF!,5,FALSE)","v":{"$error":"#REF!"}},{"$f":"T68-HLOOKUP(X68,#REF!,6,FALSE)","v":{"$error":"#REF!"}},{"$f":"T68-HLOOKUP(X68,#REF!,7,FALSE)","v":{"$error":"#REF!"}},{"$f":"T68-HLOOKUP(X68,#REF!,8,FALSE)","v":{"$error":"#REF!"}},{"$f":"T68-HLOOKUP(X68,#REF!,9,FALSE)","v":{"$error":"#REF!"}},null,null,null,null,null,null,null,{"$error":"#REF!"}]
["H","SO","POI",6,375640,"MONGIN","Hugo",2002,48.7,"POITIERS","F",30,32,34,66,39,41,43,84,150,262.96173665808277,101.3,null,{"$f":"IF(A69=\"F\",(IF(OR(H69>2001,H69<2004),VLOOKUP(I69,Feuil1!$G$11:$H$25,2))),IF(A69=\"H\",(IF(OR(H69>2001,H69<2004),VLOOKUP(I69,Feuil1!$A$11:$F$29,2)))))","v":"M50"},null,{"$f":"T69-HLOOKUP(X69,#REF!,2,FALSE)","v":{"$error":"#REF!"}},{"$f":"T69-HLOOKUP(X69,#REF!,3,FALSE)","v":{"$error":"#REF!"}},{"$f":"T69-HLOOKUP(X69,#REF!,4,FALSE)","v":{"$error":"#REF!"}},{"$f":"T69-HLOOKUP(X69,#REF!,5,FALSE)","v":{"$error":"#REF!"}},{"$f":"T69-HLOOKUP(X69,#REF!,6,FALSE)","v":{"$error":"#REF!"}},{"$f":"T69-HLOOKUP(X69,#REF!,7,FALSE)","v":{"$error":"#REF!"}},{"$f":"T69-HLOOKUP(X69,#REF!,8,FALSE)","v":{"$error":"#REF!"}},{"$f":"T69-HLOOKUP(X69,#REF!,9,FALSE)","v":{"$error":"#REF!"}},null,null,null,null,null,null,null,{"$error":"#REF!"}]
["H","SO","MPY",7,326262,"HAVET","Bastien",2002,49,"FIGEAC HC","F",31,33,35,68,31,33,35,68,136,237.13649550828112,87,null,{"$f":"IF(A70=\"F\",(IF(OR(H70>2001,H70<2004),VLOOKUP(I70,Feuil1!$G$11:$H$25,2))),IF(A70=\"H\",(IF(OR(H70>2001,H70<2004),VLOOKUP(I70,Feuil1!$A$11:$F$29,2)))))","v":"M50"},null,{"$f":"T70-HLOOKUP(X70,#REF!,2,FALSE)","v":{"$error":"#REF!"}},{"$f":"T70-HLOOKUP(X70,#REF!,3,FALSE)","v":{"$error":"#REF!"}},{"$f":"T70-HLOOKUP(X70,#REF!,4,FALSE)","v":{"$error":"#REF!"}},{"$f":"T70-HLOOKUP(X70,#REF!,5,FALSE)","v":{"$error":"#REF!"}},{"$f":"T70-HLOOKUP(X70,#REF!,6,FALSE)","v":{"$error":"#REF!"}},{"$f":"T70-HLOOKUP(X70,#REF!,7,FALSE)","v":{"$error":"#REF!"}},{"$f":"T70-HLOOKUP(X70,#REF!,8,FALSE)","v":{"$error":"#REF!"}},{"$f":"T70-HLOOKUP(X70,#REF!,9,FALSE)","v":{"$error":"#REF!"}},null,null,null,null,null,null,null,{"$error":"#REF!"}]
["H","CO","PDL",8,378550,"IHIHI","Ossama",2002,49.2,"CJF LAVAL - VOUTRÉ","F",26,28,30,58,36,37,38,75,133,231.08093081739182,83.8,null,{"$f":"IF(A71=\"F\",(IF(OR(H71>2001,H71<2004),VLOOKUP(I71,Feuil1!$G$11:$H$25,2))),IF(A71=\"H\",(IF(OR(H71>2001,H71<2004),VLOOKUP(I71,Feuil1!$A$11:$F$29,2)))))","v":"M50"},null,{"$f":"T71-HLOOKUP(X71,#REF!,2,FALSE)","v":{"$error":"#REF!"}},{"$f":"T71-HLOOKUP(X71,#REF!,3,FALSE)","v":{"$error":"#REF!"}},{"$f":"T71-HLOOKUP(X71,#REF!,4,FALSE)","v":{"$error":"#REF!"}},{"$f":"T71-HLOOKUP(X71,#REF!,5,FALSE)","v":{"$error":"#REF!"}},{"$f":"T71-HLOOKUP(X71,#REF!,6,FALSE)","v":{"$error":"#REF!"}},{"$f":"T71-HLOOKUP(X71,#REF!,7,FALSE)","v":{"$error":"#REF!"}},{"$f":"T71-HLOOKUP(X71,#REF!,8,FALSE)","v":{"$error":"#REF!"}},{"$f":"T71-HLOOKUP(X71,#REF!,9,FALSE)","v":{"$error":"#REF!"}},null,null,null,null,null,null,null,{"$error":"#REF!"}]
["H","NORD","NPC",9,376898,"MANGELLE","Kenzo",2003,47.4,"ST POL/MER","F",24,26,28,54,34,36,38,74,128,229.85991832352835,80.599999999999994,null,{"$f":"IF(A72=\"F\",(IF(OR(H72>2001,H72<2004),VLOOKUP(I72,Feuil1!$G$11:$H$25,2))),IF(A72=\"H\",(IF(OR(H72>2001,H72<2004),VLOOKUP(I72,Feuil1!$A$11:$F$29,2)))))","v":"M50"},null,{"$f":"T72-HLOOKUP(X72,#REF!,2,FALSE)","v":{"$error":"#REF!"}},{"$f":"T72-HLOOKUP(X72,#REF!,3,FALSE)","v":{"$error":"#REF!"}},{"$f":"T72-HLOOKUP(X72,#REF!,4,FALSE)","v":{"$error":"#REF!"}},{"$f":"T72-HLOOKUP(X72,#REF!,5,FALSE)","v":{"$error":"#REF!"}},{"$f":"T72-HLOOKUP(X72,#REF!,6,FALSE)","v":{"$error":"#REF!"}},{"$f":"T72-HLOOKUP(X72,#REF!,7,FALSE)","v":{"$error":"#REF!"}},{"$f":"T72-HLOOKUP(X72,#REF!,8,FALSE)","v":{"$error":"#REF!"}},{"$f":"T72-HLOOKUP(X72,#REF!,9,FALSE)","v":{"$error":"#REF!"}},null,null,null,null,null,null,null,{"$error":"#REF!"}]
["H","N","IDF",10,377315,"CAGNY","RAFAEL",2003,50,"FRANCONVILLE","F",23,25,27,52,35,37,39,76,128,219.30343143575627,78,null,{"$f":"IF(A73=\"F\",(IF(OR(H73>2001,H73<2004),VLOOKUP(I73,Feuil1!$G$11:$H$25,2))),IF(A73=\"H\",(IF(OR(H73>2001,H73<2004),VLOOKUP(I73,Feuil1!$A$11:$F$29,2)))))","v":"M50"},null,{"$f":"T73-HLOOKUP(X73,#REF!,2,FALSE)","v":{"$error":"#REF!"}},{"$f":"T73-HLOOKUP(X73,#REF!,3,FALSE)","v":{"$error":"#REF!"}},{"$f":"T73-HLOOKUP(X73,#REF!,4,FALSE)","v":{"$error":"#REF!"}},{"$f":"T73-HLOOKUP(X73,#REF!,5,FALSE)","v":{"$error":"#REF!"}},{"$f":"T73-HLOOKUP(X73,#REF!,6,FALSE)","v":{"$error":"#REF!"}},{"$f":"T73-HLOOKUP(X73,#REF!,7,FALSE)","v":{"$error":"#REF!"}},{"$f":"T73-HLOOKUP(X73,#REF!,8,FALSE)","v":{"$error":"#REF!"}},{"$f":"T73-HLOOKUP(X73,#REF!,9,FALSE)","v":{"$error":"#REF!"}},null,null,null,null,null,null,null,{"$error":"#REF!"}]
["H","NORD","NPC",11,344407,"GALLOO","Martin",2002,45.4,"CHCD COMINES","F",23,25,27,52,34,36,38,74,126,235.35876098604211,80.599999999999994,null,{"$f":"IF(A74=\"F\",(IF(OR(H74>2001,H74<2004),VLOOKUP(I74,Feuil1!$G$11:$H$25,2))),IF(A74=\"H\",(IF(OR(H74>2001,H74<2004),VLOOKUP(I74,Feuil1!$A$11:$F$29,2)))))","v":"M50"},null,{"$f":"T74-HLOOKUP(X74,#REF!,2,FALSE)","v":{"$error":"#REF!"}},{"$f":"T74-HLOOKUP(X74,#REF!,3,FALSE)","v":{"$error":"#REF!"}},{"$f":"T74-HLOOKUP(X74,#REF!,4,FALSE)","v":{"$error":"#REF!"}},{"$f":"T74-HLOOKUP(X74,#REF!,5,FALSE)","v":{"$error":"#REF!"}},{"$f":"T74-HLOOKUP(X74,#REF!,6,FALSE)","v":{"$error":"#REF!"}},{"$f":"T74-HLOOKUP(X74,#REF!,7,FALSE)","v":{"$error":"#REF!"}},{"$f":"T74-HLOOKUP(X74,#REF!,8,FALSE)","v":{"$error":"#REF!"}},{"$f":"T74-HLOOKUP(X74,#REF!,9,FALSE)","v":{"$error":"#REF!"}},null,null,null,null,null,null,null,{"$error":"#REF!"}]
["H","ZCO","BRE",12,378681,"OUDIN","Fabien",2003,48.9,"CHM Plouhinec","F",24,26,28,54,32,-34,34,66,120,209.61313216765848,71.099999999999994,null,{"$f":"IF(A75=\"F\",(IF(OR(H75>2001,H75<2004),VLOOKUP(I75,Feuil1!$G$11:$H$25,2))),IF(A75=\"H\",(IF(OR(H75>2001,H75<2004),VLOOKUP(I75,Feuil1!$A$11:$F$29,2)))))","v":"M50"},null,{"$f":"T75-HLOOKUP(X75,#REF!,2,FALSE)","v":{"$error":"#REF!"}},{"$f":"T75-HLOOKUP(X75,#REF!,3,FALSE)","v":{"$error":"#REF!"}},{"$f":"T75-HLOOKUP(X75,#REF!,4,FALSE)","v":{"$error":"#REF!"}},{"$f":"T75-HLOOKUP(X75,#REF!,5,FALSE)","v":{"$error":"#REF!"}},{"$f":"T75-HLOOKUP(X75,#REF!,6,FALSE)","v":{"$error":"#REF!"}},{"$f":"T75-HLOOKUP(X75,#REF!,7,FALSE)","v":{"$error":"#REF!"}},{"$f":"T75-HLOOKUP(X75,#REF!,8,FALSE)","v":{"$error":"#REF!"}},{"$f":"T75-HLOOKUP(X75,#REF!,9,FALSE)","v":{"$error":"#REF!"}},null,null,null,null,null,null,null,{"$error":"#REF!"}]
["H","SEST","RAL",13,378094,"DENIS","Thomas",2002,49.2,"CHAMBON FEUG","F",25,27,28,55,30,-32,32,62,117,203.28172109499883,67.8,null,{"$f":"IF(A76=\"F\",(IF(OR(H76>2001,H76<2004),VLOOKUP(I76,Feuil1!$G$11:$H$25,2))),IF(A76=\"H\",(IF(OR(H76>2001,H76<2004),VLOOKUP(I76,Feuil1!$A$11:$F$29,2)))))","v":"M50"},null,{"$f":"T76-HLOOKUP(X76,#REF!,2,FALSE)","v":{"$error":"#REF!"}},{"$f":"T76-HLOOKUP(X76,#REF!,3,FALSE)","v":{"$error":"#REF!"}},{"$f":"T76-HLOOKUP(X76,#REF!,4,FALSE)","v":{"$error":"#REF!"}},{"$f":"T76-HLOOKUP(X76,#REF!,5,FALSE)","v":{"$error":"#REF!"}},{"$f":"T76-HLOOKUP(X76,#REF!,6,FALSE)","v":{"$error":"#REF!"}},{"$f":"T76-HLOOKUP(X76,#REF!,7,FALSE)","v":{"$error":"#REF!"}},{"$f":"T76-HLOOKUP(X76,#REF!,8,FALSE)","v":{"$error":"#REF!"}},{"$f":"T76-HLOOKUP(X76,#REF!,9,FALSE)","v":{"$error":"#REF!"}},null,null,null,null,null,null,null,{"$error":"#REF!"}]
["H","ZCO","BRE",14,364030,"RAGOT","Antoine",2002,48.28,"HC Pleurtuit","F",23,24,-25,47,29,30,32,62,109,192.55282504633806,60.72,null,{"$f":"IF(A77=\"F\",(IF(OR(H77>2001,H77<2004),VLOOKUP(I77,Feuil1!$G$11:$H$25,2))),IF(A77=\"H\",(IF(OR(H77>2001,H77<2004),VLOOKUP(I77,Feuil1!$A$11:$F$29,2)))))","v":"M50"},null,{"$f":"T77-HLOOKUP(X77,#REF!,2,FALSE)","v":{"$error":"#REF!"}},{"$f":"T77-HLOOKUP(X77,#REF!,3,FALSE)","v":{"$error":"#REF!"}},{"$f":"T77-HLOOKUP(X77,#REF!,4,FALSE)","v":{"$error":"#REF!"}},{"$f":"T77-HLOOKUP(X77,#REF!,5,FALSE)","v":{"$error":"#REF!"}},{"$f":"T77-HLOOKUP(X77,#REF!,6,FALSE)","v":{"$error":"#REF!"}},{"$f":"T77-HLOOKUP(X77,#REF!,7,FALSE)","v":{"$error":"#REF!"}},{"$f":"T77-HLOOKUP(X77,#REF!,8,FALSE)","v":{"$error":"#REF!"}},{"$f":"T77-HLOOKUP(X77,#REF!,9,FALSE)","v":{"$error":"#REF!"}},null,null,null,null,null,null,null,{"$error":"#REF!"}]
["H","NORD","PIC",15,364932,"VICART","Mathéo",2002,48.6,"Saleux CHM","F",22,24,26,50,26,28,30,58,108,189.6755668371047,59.4,null,{"$f":"IF(A78=\"F\",(IF(OR(H78>2001,H78<2004),VLOOKUP(I78,Feuil1!$G$11:$H$25,2))),IF(A78=\"H\",(IF(OR(H78>2001,H78<2004),VLOOKUP(I78,Feuil1!$A$11:$F$29,2)))))","v":"M50"},null,{"$f":"T78-HLOOKUP(X78,#REF!,2,FALSE)","v":{"$error":"#REF!"}},{"$f":"T78-HLOOKUP(X78,#REF!,3,FALSE)","v":{"$error":"#REF!"}},{"$f":"T78-HLOOKUP(X78,#REF!,4,FALSE)","v":{"$error":"#REF!"}},{"$f":"T78-HLOOKUP(X78,#REF!,5,FALSE)","v":{"$error":"#REF!"}},{"$f":"T78-HLOOKUP(X78,#REF!,6,FALSE)","v":{"$error":"#REF!"}},{"$f":"T78-HLOOKUP(X78,#REF!,7,FALSE)","v":{"$error":"#REF!"}},{"$f":"T78-HLOOKUP(X78,#REF!,8,FALSE)","v":{"$error":"#REF!"}},{"$f":"T78-HLOOKUP(X78,#REF!,9,FALSE)","v":{"$error":"#REF!"}},null,null,null,null,null,null,null,{"$error":"#REF!"}]
["H","SEST","PRO",16,364002,"CHOMIENNE","Tristan",2002,50,"ISTRES SPORTS","F",20,22,24,46,26,28,30,58,104,178.18403804155196,54,null,{"$f":"IF(A79=\"F\",(IF(OR(H79>2001,H79<2004),VLOOKUP(I79,Feuil1!$G$11:$H$25,2))),IF(A79=\"H\",(IF(OR(H79>2001,H79<2004),VLOOKUP(I79,Feuil1!$A$11:$F$29,2)))))","v":"M50"},null,{"$f":"T79-HLOOKUP(X79,#REF!,2,FALSE)","v":{"$error":"#REF!"}},{"$f":"T79-HLOOKUP(X79,#REF!,3,FALSE)","v":{"$error":"#REF!"}},{"$f":"T79-HLOOKUP(X79,#REF!,4,FALSE)","v":{"$error":"#REF!"}},{"$f":"T79-HLOOKUP(X79,#REF!,5,FALSE)","v":{"$error":"#REF!"}},{"$f":"T79-HLOOKUP(X79,#REF!,6,FALSE)","v":{"$error":"#REF!"}},{"$f":"T79-HLOOKUP(X79,#REF!,7,FALSE)","v":{"$error":"#REF!"}},{"$f":"T79-HLOOKUP(X79,#REF!,8,FALSE)","v":{"$error":"#REF!"}},{"$f":"T79-HLOOKUP(X79,#REF!,9,FALSE)","v":{"$error":"#REF!"}},null,null,null,null,null,null,null,{"$error":"#REF!"}]
["H","SEST","CAZ",17,395173,"IPATOV","Daniel",2002,47.96,"ES VILLENEUVE LOUBET","R",20,-22,22,42,26,28,30,58,100,177.70073714902733,52.04,null,{"$f":"IF(A80=\"F\",(IF(OR(H80>2001,H80<2004),VLOOKUP(I80,Feuil1!$G$11:$H$25,2))),IF(A80=\"H\",(IF(OR(H80>2001,H80<2004),VLOOKUP(I80,Feuil1!$A$11:$F$29,2)))))","v":"M50"},null,{"$f":"T80-HLOOKUP(X80,#REF!,2,FALSE)","v":{"$error":"#REF!"}},{"$f":"T80-HLOOKUP(X80,#REF!,3,FALSE)","v":{"$error":"#REF!"}},{"$f":"T80-HLOOKUP(X80,#REF!,4,FALSE)","v":{"$error":"#REF!"}},{"$f":"T80-HLOOKUP(X80,#REF!,5,FALSE)","v":{"$error":"#REF!"}},{"$f":"T80-HLOOKUP(X80,#REF!,6,FALSE)","v":{"$error":"#REF!"}},{"$f":"T80-HLOOKUP(X80,#REF!,7,FALSE)","v":{"$error":"#REF!"}},{"$f":"T80-HLOOKUP(X80,#REF!,8,FALSE)","v":{"$error":"#REF!"}},{"$f":"T80-HLOOKUP(X80,#REF!,9,FALSE)","v":{"$error":"#REF!"}},null,null,null,null,null,null,null,{"$error":"#REF!"}]
["H","NE","ALS",18,355143,"DELORME","CYRIL",2003,49.5,"SR Obernai HM","F",17,19,21,40,26,28,30,58,98,169.37098320871596,48.5,null,{"$f":"IF(A81=\"F\",(IF(OR(H81>2001,H81<2004),VLOOKUP(I81,Feuil1!$G$11:$H$25,2))),IF(A81=\"H\",(IF(OR(H81>2001,H81<2004),VLOOKUP(I81,Feuil1!$A$11:$F$29,2)))))","v":"M50"},null,{"$f":"T81-HLOOKUP(X81,#REF!,2,FALSE)","v":{"$error":"#REF!"}},{"$f":"T81-HLOOKUP(X81,#REF!,3,FALSE)","v":{"$error":"#REF!"}},{"$f":"T81-HLOOKUP(X81,#REF!,4,FALSE)","v":{"$error":"#REF!"}},{"$f":"T81-HLOOKUP(X81,#REF!,5,FALSE)","v":{"$error":"#REF!"}},{"$f":"T81-HLOOKUP(X81,#REF!,6,FALSE)","v":{"$error":"#REF!"}},{"$f":"T81-HLOOKUP(X81,#REF!,7,FALSE)","v":{"$error":"#REF!"}},{"$f":"T81-HLOOKUP(X81,#REF!,8,FALSE)","v":{"$error":"#REF!"}},{"$f":"T81-HLOOKUP(X81,#REF!,9,FALSE)","v":{"$error":"#REF!"}},null,null,null,null,null,null,null,{"$error":"#REF!"}]
["H","N","IDF",19,380705,"BEKKOUCH","ILIES",2002,49.2,"CACHAN","F",16,18,20,38,27,29,30,59,97,168.53270894200756,47.8,null,{"$f":"IF(A82=\"F\",(IF(OR(H82>2001,H82<2004),VLOOKUP(I82,Feuil1!$G$11:$H$25,2))),IF(A82=\"H\",(IF(OR(H82>2001,H82<2004),VLOOKUP(I82,Feuil1!$A$11:$F$29,2)))))","v":"M50"},null,{"$f":"T82-HLOOKUP(X82,#REF!,2,FALSE)","v":{"$error":"#REF!"}},{"$f":"T82-HLOOKUP(X82,#REF!,3,FALSE)","v":{"$error":"#REF!"}},{"$f":"T82-HLOOKUP(X82,#REF!,4,FALSE)","v":{"$error":"#REF!"}},{"$f":"T82-HLOOKUP(X82,#REF!,5,FALSE)","v":{"$error":"#REF!"}},{"$f":"T82-HLOOKUP(X82,#REF!,6,FALSE)","v":{"$error":"#REF!"}},{"$f":"T82-HLOOKUP(X82,#REF!,7,FALSE)","v":{"$error":"#REF!"}},{"$f":"T82-HLOOKUP(X82,#REF!,8,FALSE)","v":{"$error":"#REF!"}},{"$f":"T82-HLOOKUP(X82,#REF!,9,FALSE)","v":{"$error":"#REF!"}},null,null,null,null,null,null,null,{"$error":"#REF!"}]
["H","SO","AQU",20,390374,"GANESHARAJAH","ABIESHEK",2002,45.7,"MONT DE MARSAN","SRL",15,18,19,37,25,27,30,57,94,174.51717199051413,48.3,null,{"$f":"IF(A83=\"F\",(IF(OR(H83>2001,H83<2004),VLOOKUP(I83,Feuil1!$G$11:$H$25,2))),IF(A83=\"H\",(IF(OR(H83>2001,H83<2004),VLOOKUP(I83,Feuil1!$A$11:$F$29,2)))))","v":"M50"},null,{"$f":"T83-HLOOKUP(X83,#REF!,2,FALSE)","v":{"$error":"#REF!"}},{"$f":"T83-HLOOKUP(X83,#REF!,3,FALSE)","v":{"$error":"#REF!"}},{"$f":"T83-HLOOKUP(X83,#REF!,4,FALSE)","v":{"$error":"#REF!"}},{"$f":"T83-HLOOKUP(X83,#REF!,5,FALSE)","v":{"$error":"#REF!"}},{"$f":"T83-HLOOKUP(X83,#REF!,6,FALSE)","v":{"$error":"#REF!"}},{"$f":"T83-HLOOKUP(X83,#REF!,7,FALSE)","v":{"$error":"#REF!"}},{"$f":"T83-HLOOKUP(X83,#REF!,8,FALSE)","v":{"$error":"#REF!"}},{"$f":"T83-HLOOKUP(X83,#REF!,9,FALSE)","v":{"$error":"#REF!"}},null,null,null,null,null,null,null,{"$error":"#REF!"}]
["H","ZCO","BRE",21,327176,"FETIVEAU","Brian",2003,48.7,"ES Saint-Avé","F",21,23,-25,44,22,24,26,50,94,164.78935497239854,45.3,null,{"$f":"IF(A84=\"F\",(IF(OR(H84>2001,H84<2004),VLOOKUP(I84,Feuil1!$G$11:$H$25,2))),IF(A84=\"H\",(IF(OR(H84>2001,H84<2004),VLOOKUP(I84,Feuil1!$A$11:$F$29,2)))))","v":"M50"},null,{"$f":"T84-HLOOKUP(X84,#REF!,2,FALSE)","v":{"$error":"#REF!"}},{"$f":"T84-HLOOKUP(X84,#REF!,3,FALSE)","v":{"$error":"#REF!"}},{"$f":"T84-HLOOKUP(X84,#REF!,4,FALSE)","v":{"$error":"#REF!"}},{"$f":"T84-HLOOKUP(X84,#REF!,5,FALSE)","v":{"$error":"#REF!"}},{"$f":"T84-HLOOKUP(X84,#REF!,6,FALSE)","v":{"$error":"#REF!"}},{"$f":"T84-HLOOKUP(X84,#REF!,7,FALSE)","v":{"$error":"#REF!"}},{"$f":"T84-HLOOKUP(X84,#REF!,8,FALSE)","v":{"$error":"#REF!"}},{"$f":"T84-HLOOKUP(X84,#REF!,9,FALSE)","v":{"$error":"#REF!"}},null,null,null,null,null,null,null,{"$error":"#REF!"}]
["H","NE","ALS",22,375935,"CIZEK","ERWAN",2002,45.7,"SHC Haguenau","F",17,19,21,40,22,24,26,50,90,167.09090935261989,44.3,null,{"$f":"IF(A85=\"F\",(IF(OR(H85>2001,H85<2004),VLOOKUP(I85,Feuil1!$G$11:$H$25,2))),IF(A85=\"H\",(IF(OR(H85>2001,H85<2004),VLOOKUP(I85,Feuil1!$A$11:$F$29,2)))))","v":"M50"},null,{"$f":"T85-HLOOKUP(X85,#REF!,2,FALSE)","v":{"$error":"#REF!"}},{"$f":"T85-HLOOKUP(X85,#REF!,3,FALSE)","v":{"$error":"#REF!"}},{"$f":"T85-HLOOKUP(X85,#REF!,4,FALSE)","v":{"$error":"#REF!"}},{"$f":"T85-HLOOKUP(X85,#REF!,5,FALSE)","v":{"$error":"#REF!"}},{"$f":"T85-HLOOKUP(X85,#REF!,6,FALSE)","v":{"$error":"#REF!"}},{"$f":"T85-HLOOKUP(X85,#REF!,7,FALSE)","v":{"$error":"#REF!"}},{"$f":"T85-HLOOKUP(X85,#REF!,8,FALSE)","v":{"$error":"#REF!"}},{"$f":"T85-HLOOKUP(X85,#REF!,9,FALSE)","v":{"$error":"#REF!"}},null,null,null,null,null,null,null,{"$error":"#REF!"}]
["H","NORD","PIC",23,376821,"LEGER LESOT","Dylan",2002,45.68,"La Vaillante Saint Quentin","F",15,17,19,36,22,24,-26,46,82,152.29998286474515,36.32,null,{"$f":"IF(A86=\"F\",(IF(OR(H86>2001,H86<2004),VLOOKUP(I86,Feuil1!$G$11:$H$25,2))),IF(A86=\"H\",(IF(OR(H86>2001,H86<2004),VLOOKUP(I86,Feuil1!$A$11:$F$29,2)))))","v":"M50"},null,{"$f":"T86-HLOOKUP(X86,#REF!,2,FALSE)","v":{"$error":"#REF!"}},{"$f":"T86-HLOOKUP(X86,#REF!,3,FALSE)","v":{"$error":"#REF!"}},{"$f":"T86-HLOOKUP(X86,#REF!,4,FALSE)","v":{"$error":"#REF!"}},{"$f":"T86-HLOOKUP(X86,#REF!,5,FALSE)","v":{"$error":"#REF!"}},{"$f":"T86-HLOOKUP(X86,#REF!,6,FALSE)","v":{"$error":"#REF!"}},{"$f":"T86-HLOOKUP(X86,#REF!,7,FALSE)","v":{"$error":"#REF!"}},{"$f":"T86-HLOOKUP(X86,#REF!,8,FALSE)","v":{"$error":"#REF!"}},{"$f":"T86-HLOOKUP(X86,#REF!,9,FALSE)","v":{"$error":"#REF!"}},null,null,null,null,null,null,null,{"$error":"#REF!"}]
["H","NE","CHA",24,387908,"CHAMARANDE","Johanny",2002,45.95,"Langres HM","F",15,17,19,36,16,18,20,38,74,136.69643935091869,28.049999999999997,null,{"$f":"IF(A87=\"F\",(IF(OR(H87>2001,H87<2004),VLOOKUP(I87,Feuil1!$G$11:$H$25,2))),IF(A87=\"H\",(IF(OR(H87>2001,H87<2004),VLOOKUP(I87,Feuil1!$A$11:$F$29,2)))))","v":"M50"},null,{"$f":"T87-HLOOKUP(X87,#REF!,2,FALSE)","v":{"$error":"#REF!"}},{"$f":"T87-HLOOKUP(X87,#REF!,3,FALSE)","v":{"$error":"#REF!"}},{"$f":"T87-HLOOKUP(X87,#REF!,4,FALSE)","v":{"$error":"#REF!"}},{"$f":"T87-HLOOKUP(X87,#REF!,5,FALSE)","v":{"$error":"#REF!"}},{"$f":"T87-HLOOKUP(X87,#REF!,6,FALSE)","v":{"$error":"#REF!"}},{"$f":"T87-HLOOKUP(X87,#REF!,7,FALSE)","v":{"$error":"#REF!"}},{"$f":"T87-HLOOKUP(X87,#REF!,8,FALSE)","v":{"$error":"#REF!"}},{"$f":"T87-HLOOKUP(X87,#REF!,9,FALSE)","v":{"$error":"#REF!"}},null,null,null,null,null,null,null,{"$error":"#REF!"}]
["H","NE","ALS",25,383774,"VERGNAUD","JAROD",2003,46.14,"SHC Haguenau","F",16,17,-18,33,19,21,-23,40,73,134.33888232814294,26.86,null,{"$f":"IF(A88=\"F\",(IF(OR(H88>2001,H88<2004),VLOOKUP(I88,Feuil1!$G$11:$H$25,2))),IF(A88=\"H\",(IF(OR(H88>2001,H88<2004),VLOOKUP(I88,Feuil1!$A$11:$F$29,2)))))","v":"M50"},null,{"$f":"T88-HLOOKUP(X88,#REF!,2,FALSE)","v":{"$error":"#REF!"}},{"$f":"T88-HLOOKUP(X88,#REF!,3,FALSE)","v":{"$error":"#REF!"}},{"$f":"T88-HLOOKUP(X88,#REF!,4,FALSE)","v":{"$error":"#REF!"}},{"$f":"T88-HLOOKUP(X88,#REF!,5,FALSE)","v":{"$error":"#REF!"}},{"$f":"T88-HLOOKUP(X88,#REF!,6,FALSE)","v":{"$error":"#REF!"}},{"$f":"T88-HLOOKUP(X88,#REF!,7,FALSE)","v":{"$error":"#REF!"}},{"$f":"T88-HLOOKUP(X88,#REF!,8,FALSE)","v":{"$error":"#REF!"}},{"$f":"T88-HLOOKUP(X88,#REF!,9,FALSE)","v":{"$error":"#REF!"}},null,null,null,null,null,null,null,{"$error":"#REF!"}]
["H","CO","BNO",26,377449,"Anquetil","Kilian",2002,45.3,"Giberville","F",12,13,14,27,16,17,19,36,63,117.92077918349175,17.700000000000003,null,{"$f":"IF(A89=\"F\",(IF(OR(H89>2001,H89<2004),VLOOKUP(I89,Feuil1!$G$11:$H$25,2))),IF(A89=\"H\",(IF(OR(H89>2001,H89<2004),VLOOKUP(I89,Feuil1!$A$11:$F$29,2)))))","v":"M50"},null,{"$f":"T89-HLOOKUP(X89,#REF!,2,FALSE)","v":{"$error":"#REF!"}},{"$f":"T89-HLOOKUP(X89,#REF!,3,FALSE)","v":{"$error":"#REF!"}},{"$f":"T89-HLOOKUP(X89,#REF!,4,FALSE)","v":{"$error":"#REF!"}},{"$f":"T89-HLOOKUP(X89,#REF!,5,FALSE)","v":{"$error":"#REF!"}},{"$f":"T89-HLOOKUP(X89,#REF!,6,FALSE)","v":{"$error":"#REF!"}},{"$f":"T89-HLOOKUP(X89,#REF!,7,FALSE)","v":{"$error":"#REF!"}},{"$f":"T89-HLOOKUP(X89,#REF!,8,FALSE)","v":{"$error":"#REF!"}},{"$f":"T89-HLOOKUP(X89,#REF!,9,FALSE)","v":{"$error":"#REF!"}},null,null,null,null,null,null,null,{"$error":"#REF!"}]
["H","NE","CHA",27,396856,"KESLER "," Patrick",2002,45.2,"Langres HM","F",10,12,14,26,14,-16,16,30,56,105.03431637465668,10.799999999999997,null,{"$f":"IF(A90=\"F\",(IF(OR(H90>2001,H90<2004),VLOOKUP(I90,Feuil1!$G$11:$H$25,2))),IF(A90=\"H\",(IF(OR(H90>2001,H90<2004),VLOOKUP(I90,Feuil1!$A$11:$F$29,2)))))","v":"M50"},null,{"$f":"T90-HLOOKUP(X90,#REF!,2,FALSE)","v":{"$error":"#REF!"}},{"$f":"T90-HLOOKUP(X90,#REF!,3,FALSE)","v":{"$error":"#REF!"}},{"$f":"T90-HLOOKUP(X90,#REF!,4,FALSE)","v":{"$error":"#REF!"}},{"$f":"T90-HLOOKUP(X90,#REF!,5,FALSE)","v":{"$error":"#REF!"}},{"$f":"T90-HLOOKUP(X90,#REF!,6,FALSE)","v":{"$error":"#REF!"}},{"$f":"T90-HLOOKUP(X90,#REF!,7,FALSE)","v":{"$error":"#REF!"}},{"$f":"T90-HLOOKUP(X90,#REF!,8,FALSE)","v":{"$error":"#REF!"}},{"$f":"T90-HLOOKUP(X90,#REF!,9,FALSE)","v":{"$error":"#REF!"}},null,null,null,null,null,null,null,{"$error":"#REF!"}]
["H","SO","MPY",28,375974,"MIQUEL","Noah",2003,45.2,"MONTAUBAN HC","F",9,11,12,23,14,16,17,33,56,105.03431637465668,10.799999999999997,null,{"$f":"IF(A91=\"F\",(IF(OR(H91>2001,H91<2004),VLOOKUP(I91,Feuil1!$G$11:$H$25,2))),IF(A91=\"H\",(IF(OR(H91>2001,H91<2004),VLOOKUP(I91,Feuil1!$A$11:$F$29,2)))))","v":"M50"},null,{"$f":"T91-HLOOKUP(X91,#REF!,2,FALSE)","v":{"$error":"#REF!"}},{"$f":"T91-HLOOKUP(X91,#REF!,3,FALSE)","v":{"$error":"#REF!"}},{"$f":"T91-HLOOKUP(X91,#REF!,4,FALSE)","v":{"$error":"#REF!"}},{"$f":"T91-HLOOKUP(X91,#REF!,5,FALSE)","v":{"$error":"#REF!"}},{"$f":"T91-HLOOKUP(X91,#REF!,6,FALSE)","v":{"$error":"#REF!"}},{"$f":"T91-HLOOKUP(X91,#REF!,7,FALSE)","v":{"$error":"#REF!"}},{"$f":"T91-HLOOKUP(X91,#REF!,8,FALSE)","v":{"$error":"#REF!"}},{"$f":"T91-HLOOKUP(X91,#REF!,9,FALSE)","v":{"$error":"#REF!"}},null,null,null,null,null,null,null,{"$error":"#REF!"}]
["H","ZCO","CEN",29,386546,"CLAVIER","Mathéo",2002,47.4,"CHM CHATEAUROUX","F",11,-12,12,23,14,15,16,31,54,96.972153042738526,6.6000000000000014,null,{"$f":"IF(A92=\"F\",(IF(OR(H92>2001,H92<2004),VLOOKUP(I92,Feuil1!$G$11:$H$25,2))),IF(A92=\"H\",(IF(OR(H92>2001,H92<2004),VLOOKUP(I92,Feuil1!$A$11:$F$29,2)))))","v":"M50"},null,{"$f":"T92-HLOOKUP(X92,#REF!,2,FALSE)","v":{"$error":"#REF!"}},{"$f":"T92-HLOOKUP(X92,#REF!,3,FALSE)","v":{"$error":"#REF!"}},{"$f":"T92-HLOOKUP(X92,#REF!,4,FALSE)","v":{"$error":"#REF!"}},{"$f":"T92-HLOOKUP(X92,#REF!,5,FALSE)","v":{"$error":"#REF!"}},{"$f":"T92-HLOOKUP(X92,#REF!,6,FALSE)","v":{"$error":"#REF!"}},{"$f":"T92-HLOOKUP(X92,#REF!,7,FALSE)","v":{"$error":"#REF!"}},{"$f":"T92-HLOOKUP(X92,#REF!,8,FALSE)","v":{"$error":"#REF!"}},{"$f":"T92-HLOOKUP(X92,#REF!,9,FALSE)","v":{"$error":"#REF!"}},null,null,null,null,null,null,null,{"$error":"#REF!"}]
["H","ZCO","BRE",30,378685,"AUTRET ","Ian ",2003,45.4,"CHM Plouhinec","F",12,13,14,27,11,12,13,25,52,97.132187073604683,6.6000000000000014,null,{"$f":"IF(A93=\"F\",(IF(OR(H93>2001,H93<2004),VLOOKUP(I93,Feuil1!$G$11:$H$25,2))),IF(A93=\"H\",(IF(OR(H93>2001,H93<2004),VLOOKUP(I93,Feuil1!$A$11:$F$29,2)))))","v":"M50"},null,{"$f":"T93-HLOOKUP(X93,#REF!,2,FALSE)","v":{"$error":"#REF!"}},{"$f":"T93-HLOOKUP(X93,#REF!,3,FALSE)","v":{"$error":"#REF!"}},{"$f":"T93-HLOOKUP(X93,#REF!,4,FALSE)","v":{"$error":"#REF!"}},{"$f":"T93-HLOOKUP(X93,#REF!,5,FALSE)","v":{"$error":"#REF!"}},{"$f":"T93-HLOOKUP(X93,#REF!,6,FALSE)","v":{"$error":"#REF!"}},{"$f":"T93-HLOOKUP(X93,#REF!,7,FALSE)","v":{"$error":"#REF!"}},{"$f":"T93-HLOOKUP(X93,#REF!,8,FALSE)","v":{"$error":"#REF!"}},{"$f":"T93-HLOOKUP(X93,#REF!,9,FALSE)","v":{"$error":"#REF!"}},null,null,null,null,null,null,null,{"$error":"#REF!"}]
[null,null,null,null,null,null,null,null,null,null,null,null,null,null,null,null,null,null,null,null,null,null,null,null,null,null," ",{"$f":"T94-HLOOKUP(X94,[1]Feuil1!$C$1:$BL$10,2,FALSE)","v":{"$error":"#N/A"}},{"$f":"T94-HLOOKUP(X94,[1]Feuil1!$C$1:$BL$10,3,FALSE)","v":{"$error":"#N/A"}},{"$f":"T94-HLOOKUP(X94,[1]Feuil1!$C$1:$BL$10,4,FALSE)","v":{"$error":"#N/A"}},{"$f":"T94-HLOOKUP(X94,[1]Feuil1!$C$1:$BL$10,5,FALSE)","v":{"$error":"#N/A"}},{"$f":"T94-HLOOKUP(X94,[1]Feuil1!$C$1:$BL$10,6,FALSE)","v":{"$error":"#N/A"}},{"$f":"T94-HLOOKUP(X94,[1]Feuil1!$C$1:$BL$10,7,FALSE)","v":{"$error":"#N/A"}},{"$f":"T94-HLOOKUP(X94,[1]Feuil1!$C$1:$BL$10,8,FALSE)","v":{"$error":"#N/A"}},{"$f":"T94-HLOOKUP(X94,[1]Feuil1!$C$1:$BL$10,9,FALSE)","v":{"$error":"#N/A"}},{"$f":"T94-HLOOKUP(X94,[1]Feuil1!$C$1:$BL$10,10,FALSE)","v":{"$error":"#N/A"}},null,null,null,null,null,null,{"$f":"IF(AJ94>=0,$AJ$4,IF(AI94>=0,$AI$4,IF(AH94>=0,$AH$4,IF(AG94>=0,$AG$4,IF(AF94>=0,$AF$4,IF(AE94>=0,$AE$4,IF(AD94>=0,$AD$4,IF(AC94>=0,$AC$4,$AB$4))))))))","v":{"$error":"#N/A"}}]
["H","NE","ALS",1,324091,"SPAGNULO","GIACOMO",2002,56,"SHC Haguenau","F",53,55,-57,{"$f":"IF(MAXA(L95+M95,M95+N95,L95+N95,L95,M95,N95)<=0,0,MAXA(L95+M95,M95+N95,L95+N95,L95,M95,N95))","v":108},66,67,68,{"$f":"IF(MAXA(P95+Q95,Q95+R95,P95+R95,P95,Q95,R95)<=0,0,MAXA(P95+Q95,Q95+R95,P95+R95,P95,Q95,R95))","v":135},{"$f":"IF(H95=\"\",\"\",IF(OR(O95=0,S95=0),0,O95+S95))","v":243},{"$f":"IF(I95=\"\",\"\",IF(A95=\"H\",10^(0.794358141*LOG(I95/174.393)^2)*T95,IF(A95=\"F\",10^(0.89726074 * LOG(I95/148.026)^2)*T95,\"\")))","v":379.26382317343746},{"$f":"SUM(T95-I95)","v":187},null,{"$f":"IF(A95=\"F\",(IF(OR(H95>2001,H95<2004),VLOOKUP(I95,Feuil1!$G$11:$H$25,2))),IF(A95=\"H\",(IF(OR(H95>2001,H95<2004),VLOOKUP(I95,Feuil1!$A$11:$F$29,2)))))","v":"M56"},null,{"$f":"T95-HLOOKUP(X95,#REF!,2,FALSE)","v":{"$error":"#REF!"}},{"$f":"T95-HLOOKUP(X95,#REF!,3,FALSE)","v":{"$error":"#REF!"}},{"$f":"T95-HLOOKUP(X95,#REF!,4,FALSE)","v":{"$error":"#REF!"}},{"$f":"T95-HLOOKUP(X95,#REF!,5,FALSE)","v":{"$error":"#REF!"}},{"$f":"T95-HLOOKUP(X95,#REF!,6,FALSE)","v":{"$error":"#REF!"}},{"$f":"T95-HLOOKUP(X95,#REF!,7,FALSE)","v":{"$error":"#REF!"}},{"$f":"T95-HLOOKUP(X95,#REF!,8,FALSE)","v":{"$error":"#REF!"}},{"$f":"T95-HLOOKUP(X95,#REF!,9,FALSE)","v":{"$error":"#REF!"}},null,null,null,null,null,null,null,{"$f":"IF(AG95>=0,$AG$4,IF(AF95>=0,$AF$4,IF(AE95>=0,$AE$4,IF(AD95>=0,$AD$4,IF(AC95>=0,$AC$4,IF(AB95>=0,$AB$4,IF(AA95>=0,$AA$4,IF(Z95>=0,$Z$4,$AH$4))))))))","v":{"$error":"#REF!"}}]
["H","SO","MPY",2,356782,"CANCE","Quentin",2002,54,"FIGEAC HC","F",44,46,48,94,66,68,70,138,232,372.73528156546519,178,null,{"$f":"IF(A96=\"F\",(IF(OR(H96>2001,H96<2004),VLOOKUP(I96,Feuil1!$G$11:$H$25,2))),IF(A96=\"H\",(IF(OR(H96>2001,H96<2004),VLOOKUP(I96,Feuil1!$A$11:$F$29,2)))))","v":"M56"},null,{"$f":"T96-HLOOKUP(X96,#REF!,2,FALSE)","v":{"$error":"#REF!"}},{"$f":"T96-HLOOKUP(X96,#REF!,3,FALSE)","v":{"$error":"#REF!"}},{"$f":"T96-HLOOKUP(X96,#REF!,4,FALSE)","v":{"$error":"#REF!"}},{"$f":"T96-HLOOKUP(X96,#REF!,5,FALSE)","v":{"$error":"#REF!"}},{"$f":"T96-HLOOKUP(X96,#REF!,6,FALSE)","v":{"$error":"#REF!"}},{"$f":"T96-HLOOKUP(X96,#REF!,7,FALSE)","v":{"$error":"#REF!"}},{"$f":"T96-HLOOKUP(X96,#REF!,8,FALSE)","v":{"$error":"#REF!"}},{"$f":"T96-HLOOKUP(X96,#REF!,9,FALSE)","v":{"$error":"#REF!"}},null,null,null,null,null,null,null,{"$error":"#REF!"}]
["H","DOM","REU",3,321684,"ROUGET","TIZZIANO",2002,55.6,"LES DEUX PTITS NANOS","F",40,42,44,86,54,56,58,114,200,313.91562142663895,144.4,null,{"$f":"IF(A97=\"F\",(IF(OR(H97>2001,H97<2004),VLOOKUP(I97,Feuil1!$G$11:$H$25,2))),IF(A97=\"H\",(IF(OR(H97>2001,H97<2004),VLOOKUP(I97,Feuil1!$A$11:$F$29,2)))))","v":"M56"},null,{"$f":"T97-HLOOKUP(X97,#REF!,2,FALSE)","v":{"$error":"#REF!"}},{"$f":"T97-HLOOKUP(X97,#REF!,3,FALSE)","v":{"$error":"#REF!"}},{"$f":"T97-HLOOKUP(X97,#REF!,4,FALSE)","v":{"$error":"#REF!"}},{"$f":"T97-HLOOKUP(X97,#REF!,5,FALSE)","v":{"$error":"#REF!"}},{"$f":"T97-HLOOKUP(X97,#REF!,6,FALSE)","v":{"$error":"#REF!"}},{"$f":"T97-HLOOKUP(X97,#REF!,7,FALSE)","v":{"$error":"#REF!"}},{"$f":"T97-HLOOKUP(X97,#REF!,8,FALSE)","v":{"$error":"#REF!"}},{"$f":"T97-HLOOKUP(X97,#REF!,9,FALSE)","v":{"$error":"#REF!"}},null,null,null,null,null,null,null,{"$error":"#REF!"}]
["H","NORD","NPC",4,359647,"PARANTHOEN","Jason",2002,51.8,"C.A.ROSENDAEL","F",36,38,40,78,52,54,56,110,188,312.56549140811546,136.19999999999999,null,{"$f":"IF(A98=\"F\",(IF(OR(H98>2001,H98<2004),VLOOKUP(I98,Feuil1!$G$11:$H$25,2))),IF(A98=\"H\",(IF(OR(H98>2001,H98<2004),VLOOKUP(I98,Feuil1!$A$11:$F$29,2)))))","v":"M56"},null,{"$f":"T98-HLOOKUP(X98,#REF!,2,FALSE)","v":{"$error":"#REF!"}},{"$f":"T98-HLOOKUP(X98,#REF!,3,FALSE)","v":{"$error":"#REF!"}},{"$f":"T98-HLOOKUP(X98,#REF!,4,FALSE)","v":{"$error":"#REF!"}},{"$f":"T98-HLOOKUP(X98,#REF!,5,FALSE)","v":{"$error":"#REF!"}},{"$f":"T98-HLOOKUP(X98,#REF!,6,FALSE)","v":{"$error":"#REF!"}},{"$f":"T98-HLOOKUP(X98,#REF!,7,FALSE)","v":{"$error":"#REF!"}},{"$f":"T98-HLOOKUP(X98,#REF!,8,FALSE)","v":{"$error":"#REF!"}},{"$f":"T98-HLOOKUP(X98,#REF!,9,FALSE)","v":{"$error":"#REF!"}},null,null,null,null,null,null,null,{"$error":"#REF!"}]
["H","SEST","PRO",5,364002,"CHOMIENNE","Tristan",2002,55.95,"ISTRES SPORTS","F",37,39,-41,76,-42,42,44,86,162,253.01969932276174,106.05,null,{"$f":"IF(A99=\"F\",(IF(OR(H99>2001,H99<2004),VLOOKUP(I99,Feuil1!$G$11:$H$25,2))),IF(A99=\"H\",(IF(OR(H99>2001,H99<2004),VLOOKUP(I99,Feuil1!$A$11:$F$29,2)))))","v":"M56"},null,{"$f":"T99-HLOOKUP(X99,#REF!,2,FALSE)","v":{"$error":"#REF!"}},{"$f":"T99-HLOOKUP(X99,#REF!,3,FALSE)","v":{"$error":"#REF!"}},{"$f":"T99-HLOOKUP(X99,#REF!,4,FALSE)","v":{"$error":"#REF!"}},{"$f":"T99-HLOOKUP(X99,#REF!,5,FALSE)","v":{"$error":"#REF!"}},{"$f":"T99-HLOOKUP(X99,#REF!,6,FALSE)","v":{"$error":"#REF!"}},{"$f":"T99-HLOOKUP(X99,#REF!,7,FALSE)","v":{"$error":"#REF!"}},{"$f":"T99-HLOOKUP(X99,#REF!,8,FALSE)","v":{"$error":"#REF!"}},{"$f":"T99-HLOOKUP(X99,#REF!,9,FALSE)","v":{"$error":"#REF!"}},null,null,null,null,null,null,null,{"$error":"#REF!"}]
["H","SO","MPY",6,326262,"HAVET","Bastien",2002,51.5,"FIGEAC HC","F",30,32,34,66,42,44,46,90,156,260.63073473111996,104.5,null,{"$f":"IF(A100=\"F\",(IF(OR(H100>2001,H100<2004),VLOOKUP(I100,Feuil1!$G$11:$H$25,2))),IF(A100=\"H\",(IF(OR(H100>2001,H100<2004),VLOOKUP(I100,Feuil1!$A$11:$F$29,2)))))","v":"M56"},null,{"$f":"T100-HLOOKUP(X100,#REF!,2,FALSE)","v":{"$error":"#REF!"}},{"$f":"T100-HLOOKUP(X100,#REF!,3,FALSE)","v":{"$error":"#REF!"}},{"$f":"T100-HLOOKUP(X100,#REF!,4,FALSE)","v":{"$error":"#REF!"}},{"$f":"T100-HLOOKUP(X100,#REF!,5,FALSE)","v":{"$error":"#REF!"}},{"$f":"T100-HLOOKUP(X100,#REF!,6,FALSE)","v":{"$error":"#REF!"}},{"$f":"T100-HLOOKUP(X100,#REF!,7,FALSE)","v":{"$error":"#REF!"}},{"$f":"T100-HLOOKUP(X100,#REF!,8,FALSE)","v":{"$error":"#REF!"}},{"$f":"T100-HLOOKUP(X100,#REF!,9,FALSE)","v":{"$error":"#REF!"}},null,null,null,null,null,null,null,{"$error":"#REF!"}]
["H","NE","ALS",7,375708,"DELUCCHI","MATTEO",2002,55.1,"SHC Haguenau","F",30,32,34,66,37,39,41,80,146,230.80347035151601,90.9,null,{"$f":"IF(A101=\"F\",(IF(OR(H101>2001,H101<2004),VLOOKUP(I101,Feuil1!$G$11:$H$25,2))),IF(A101=\"H\",(IF(OR(H101>2001,H101<2004),VLOOKUP(I101,Feuil1!$A$11:$F$29,2)))))","v":"M56"},null,{"$f":"T101-HLOOKUP(X101,#REF!,2,FALSE)","v":{"$error":"#REF!"}},{"$f":"T101-HLOOKUP(X101,#REF!,3,FALSE)","v":{"$error":"#REF!"}},{"$f":"T101-HLOOKUP(X101,#REF!,4,FALSE)","v":{"$error":"#REF!"}},{"$f":"T101-HLOOKUP(X101,#REF!,5,FALSE)","v":{"$error":"#REF!"}},{"$f":"T101-HLOOKUP(X101,#REF!,6,FALSE)","v":{"$error":"#REF!"}},{"$f":"T101-HLOOKUP(X101,#REF!,7,FALSE)","v":{"$error":"#REF!"}},{"$f":"T101-HLOOKUP(X101,#REF!,8,FALSE)","v":{"$error":"#REF!"}},{"$f":"T101-HLOOKUP(X101,#REF!,9,FALSE)","v":{"$error":"#REF!"}},null,null,null,null,null,null,null,{"$error":"#REF!"}]
["H","SEST","LAN",8,306124,"MARTINEZ","Léo",2003,52.9,"Clermont Sports","F",26,28,30,58,40,-42,42,82,140,228.73560884510823,87.1,null,{"$f":"IF(A102=\"F\",(IF(OR(H102>2001,H102<2004),VLOOKUP(I102,Feuil1!$G$11:$H$25,2))),IF(A102=\"H\",(IF(OR(H102>2001,H102<2004),VLOOKUP(I102,Feuil1!$A$11:$F$29,2)))))","v":"M56"},null,{"$f":"T102-HLOOKUP(X102,#REF!,2,FALSE)","v":{"$error":"#REF!"}},{"$f":"T102-HLOOKUP(X102,#REF!,3,FALSE)","v":{"$error":"#REF!"}},{"$f":"T102-HLOOKUP(X102,#REF!,4,FALSE)","v":{"$error":"#REF!"}},{"$f":"T102-HLOOKUP(X102,#REF!,5,FALSE)","v":{"$error":"#REF!"}},{"$f":"T102-HLOOKUP(X102,#REF!,6,FALSE)","v":{"$error":"#REF!"}},{"$f":"T102-HLOOKUP(X102,#REF!,7,FALSE)","v":{"$error":"#REF!"}},{"$f":"T102-HLOOKUP(X102,#REF!,8,FALSE)","v":{"$error":"#REF!"}},{"$f":"T102-HLOOKUP(X102,#REF!,9,FALSE)","v":{"$error":"#REF!"}},null,null,null,null,null,null,null,{"$error":"#REF!"}]
["H","ZCO","CEN",9,346360,"PINIAU","Mathis",2002,55.8,"CM ORLEANS","F",27,29,31,60,37,39,41,80,140,219.12047277577267,84.2,null,{"$f":"IF(A103=\"F\",(IF(OR(H103>2001,H103<2004),VLOOKUP(I103,Feuil1!$G$11:$H$25,2))),IF(A103=\"H\",(IF(OR(H103>2001,H103<2004),VLOOKUP(I103,Feuil1!$A$11:$F$29,2)))))","v":"M56"},null,{"$f":"T103-HLOOKUP(X103,#REF!,2,FALSE)","v":{"$error":"#REF!"}},{"$f":"T103-HLOOKUP(X103,#REF!,3,FALSE)","v":{"$error":"#REF!"}},{"$f":"T103-HLOOKUP(X103,#REF!,4,FALSE)","v":{"$error":"#REF!"}},{"$f":"T103-HLOOKUP(X103,#REF!,5,FALSE)","v":{"$error":"#REF!"}},{"$f":"T103-HLOOKUP(X103,#REF!,6,FALSE)","v":{"$error":"#REF!"}},{"$f":"T103-HLOOKUP(X103,#REF!,7,FALSE)","v":{"$error":"#REF!"}},{"$f":"T103-HLOOKUP(X103,#REF!,8,FALSE)","v":{"$error":"#REF!"}},{"$f":"T103-HLOOKUP(X103,#REF!,9,FALSE)","v":{"$error":"#REF!"}},null,null,null,null,null,null,null,{"$error":"#REF!"}]
["H","SEST","RAL",10,378094,"DENIS","Thomas",2002,53,"CHAMBON FEUGEROLLES","F",38,40,42,82,50,-52,-52,50,132,215.33029137187066,79,null,{"$f":"IF(A104=\"F\",(IF(OR(H104>2001,H104<2004),VLOOKUP(I104,Feuil1!$G$11:$H$25,2))),IF(A104=\"H\",(IF(OR(H104>2001,H104<2004),VLOOKUP(I104,Feuil1!$A$11:$F$29,2)))))","v":"M56"},null,{"$f":"T104-HLOOKUP(X104,#REF!,2,FALSE)","v":{"$error":"#REF!"}},{"$f":"T104-HLOOKUP(X104,#REF!,3,FALSE)","v":{"$error":"#REF!"}},{"$f":"T104-HLOOKUP(X104,#REF!,4,FALSE)","v":{"$error":"#REF!"}},{"$f":"T104-HLOOKUP(X104,#REF!,5,FALSE)","v":{"$error":"#REF!"}},{"$f":"T104-HLOOKUP(X104,#REF!,6,FALSE)","v":{"$error":"#REF!"}},{"$f":"T104-HLOOKUP(X104,#REF!,7,FALSE)","v":{"$error":"#REF!"}},{"$f":"T104-HLOOKUP(X104,#REF!,8,FALSE)","v":{"$error":"#REF!"}},{"$f":"T104-HLOOKUP(X104,#REF!,9,FALSE)","v":{"$error":"#REF!"}},null,null,null,null,null,null,null,{"$error":"#REF!"}]
["H","SEST","CAZ",11,391430,"PARISOT","Lucas",2002,56,"ES VILLENEUVE LOUBET","F",24,26,28,54,36,38,40,78,132,206.01985456334876,76,null,{"$f":"IF(A105=\"F\",(IF(OR(H105>2001,H105<2004),VLOOKUP(I105,Feuil1!$G$11:$H$25,2))),IF(A105=\"H\",(IF(OR(H105>2001,H105<2004),VLOOKUP(I105,Feuil1!$A$11:$F$29,2)))))","v":"M56"},null,{"$f":"T105-HLOOKUP(X105,#REF!,2,FALSE)","v":{"$error":"#REF!"}},{"$f":"T105-HLOOKUP(X105,#REF!,3,FALSE)","v":{"$error":"#REF!"}},{"$f":"T105-HLOOKUP(X105,#REF!,4,FALSE)","v":{"$error":"#REF!"}},{"$f":"T105-HLOOKUP(X105,#REF!,5,FALSE)","v":{"$error":"#REF!"}},{"$f":"T105-HLOOKUP(X105,#REF!,6,FALSE)","v":{"$error":"#REF!"}},{"$f":"T105-HLOOKUP(X105,#REF!,7,FALSE)","v":{"$error":"#REF!"}},{"$f":"T105-HLOOKUP(X105,#REF!,8,FALSE)","v":{"$error":"#REF!"}},{"$f":"T105-HLOOKUP(X105,#REF!,9,FALSE)","v":{"$error":"#REF!"}},null,null,null,null,null,null,null,{"$error":"#REF!"}]
["H","SEST","LAN",12,374525,"DELLACHI","Yann",2002,56,"HC Grand Combe","F",28,30,32,62,32,34,36,70,132,206.01985456334876,76,null,{"$f":"IF(A106=\"F\",(IF(OR(H106>2001,H106<2004),VLOOKUP(I106,Feuil1!$G$11:$H$25,2))),IF(A106=\"H\",(IF(OR(H106>2001,H106<2004),VLOOKUP(I106,Feuil1!$A$11:$F$29,2)))))","v":"M56"},null,{"$f":"T106-HLOOKUP(X106,#REF!,2,FALSE)","v":{"$error":"#REF!"}},{"$f":"T106-HLOOKUP(X106,#REF!,3,FALSE)","v":{"$error":"#REF!"}},{"$f":"T106-HLOOKUP(X106,#REF!,4,FALSE)","v":{"$error":"#REF!"}},{"$f":"T106-HLOOKUP(X106,#REF!,5,FALSE)","v":{"$error":"#REF!"}},{"$f":"T106-HLOOKUP(X106,#REF!,6,FALSE)","v":{"$error":"#REF!"}},{"$f":"T106-HLOOKUP(X106,#REF!,7,FALSE)","v":{"$error":"#REF!"}},{"$f":"T106-HLOOKUP(X106,#REF!,8,FALSE)","v":{"$error":"#REF!"}},{"$f":"T106-HLOOKUP(X106,#REF!,9,FALSE)","v":{"$error":"#REF!"}},null,null,null,null,null,null,null,{"$error":"#REF!"}]
["H","NE","ALS",13,378213,"LAPP","EWANN",2003,55.6,"CHM Andlau","F",28,-30,30,58,32,34,36,70,128,200.90599771304892,72.400000000000006,null,{"$f":"IF(A107=\"F\",(IF(OR(H107>2001,H107<2004),VLOOKUP(I107,Feuil1!$G$11:$H$25,2))),IF(A107=\"H\",(IF(OR(H107>2001,H107<2004),VLOOKUP(I107,Feuil1!$A$11:$F$29,2)))))","v":"M56"},null,{"$f":"T107-HLOOKUP(X107,#REF!,2,FALSE)","v":{"$error":"#REF!"}},{"$f":"T107-HLOOKUP(X107,#REF!,3,FALSE)","v":{"$error":"#REF!"}},{"$f":"T107-HLOOKUP(X107,#REF!,4,FALSE)","v":{"$error":"#REF!"}},{"$f":"T107-HLOOKUP(X107,#REF!,5,FALSE)","v":{"$error":"#REF!"}},{"$f":"T107-HLOOKUP(X107,#REF!,6,FALSE)","v":{"$error":"#REF!"}},{"$f":"T107-HLOOKUP(X107,#REF!,7,FALSE)","v":{"$error":"#REF!"}},{"$f":"T107-HLOOKUP(X107,#REF!,8,FALSE)","v":{"$error":"#REF!"}},{"$f":"T107-HLOOKUP(X107,#REF!,9,FALSE)","v":{"$error":"#REF!"}},null,null,null,null,null,null,null,{"$error":"#REF!"}]
["H","NORD","PIC",14,364932,"VICART","Mathéo",2002,52.03,"Saleux CHM","F",25,27,29,56,32,34,36,70,126,208.71089702638483,73.97,null,{"$f":"IF(A108=\"F\",(IF(OR(H108>2001,H108<2004),VLOOKUP(I108,Feuil1!$G$11:$H$25,2))),IF(A108=\"H\",(IF(OR(H108>2001,H108<2004),VLOOKUP(I108,Feuil1!$A$11:$F$29,2)))))","v":"M56"},null,{"$f":"T108-HLOOKUP(X108,#REF!,2,FALSE)","v":{"$error":"#REF!"}},{"$f":"T108-HLOOKUP(X108,#REF!,3,FALSE)","v":{"$error":"#REF!"}},{"$f":"T108-HLOOKUP(X108,#REF!,4,FALSE)","v":{"$error":"#REF!"}},{"$f":"T108-HLOOKUP(X108,#REF!,5,FALSE)","v":{"$error":"#REF!"}},{"$f":"T108-HLOOKUP(X108,#REF!,6,FALSE)","v":{"$error":"#REF!"}},{"$f":"T108-HLOOKUP(X108,#REF!,7,FALSE)","v":{"$error":"#REF!"}},{"$f":"T108-HLOOKUP(X108,#REF!,8,FALSE)","v":{"$error":"#REF!"}},{"$f":"T108-HLOOKUP(X108,#REF!,9,FALSE)","v":{"$error":"#REF!"}},null,null,null,null,null,null,null,{"$error":"#REF!"}]
["H","NE","LOR",15,378967,"MARROCCO","Nathan",2003,51.47,"H.VALLEROY-AUBOUÉ","F",26,28,29,57,33,35,-37,68,125,208.94119015098457,73.53,null,{"$f":"IF(A109=\"F\",(IF(OR(H109>2001,H109<2004),VLOOKUP(I109,Feuil1!$G$11:$H$25,2))),IF(A109=\"H\",(IF(OR(H109>2001,H109<2004),VLOOKUP(I109,Feuil1!$A$11:$F$29,2)))))","v":"M56"},null,{"$f":"T109-HLOOKUP(X109,#REF!,2,FALSE)","v":{"$error":"#REF!"}},{"$f":"T109-HLOOKUP(X109,#REF!,3,FALSE)","v":{"$error":"#REF!"}},{"$f":"T109-HLOOKUP(X109,#REF!,4,FALSE)","v":{"$error":"#REF!"}},{"$f":"T109-HLOOKUP(X109,#REF!,5,FALSE)","v":{"$error":"#REF!"}},{"$f":"T109-HLOOKUP(X109,#REF!,6,FALSE)","v":{"$error":"#REF!"}},{"$f":"T109-HLOOKUP(X109,#REF!,7,FALSE)","v":{"$error":"#REF!"}},{"$f":"T109-HLOOKUP(X109,#REF!,8,FALSE)","v":{"$error":"#REF!"}},{"$f":"T109-HLOOKUP(X109,#REF!,9,FALSE)","v":{"$error":"#REF!"}},null,null,null,null,null,null,null,{"$error":"#REF!"}]
["H","SEST","RAL",16,377320,"SERRANO","Dimitri",2002,51.5,"CHAMBON FEUGEROLLES","F",25,27,28,55,31,33,35,68,123,205.49731007645997,71.5,null,{"$f":"IF(A110=\"F\",(IF(OR(H110>2001,H110<2004),VLOOKUP(I110,Feuil1!$G$11:$H$25,2))),IF(A110=\"H\",(IF(OR(H110>2001,H110<2004),VLOOKUP(I110,Feuil1!$A$11:$F$29,2)))))","v":"M56"},null,{"$f":"T110-HLOOKUP(X110,#REF!,2,FALSE)","v":{"$error":"#REF!"}},{"$f":"T110-HLOOKUP(X110,#REF!,3,FALSE)","v":{"$error":"#REF!"}},{"$f":"T110-HLOOKUP(X110,#REF!,4,FALSE)","v":{"$error":"#REF!"}},{"$f":"T110-HLOOKUP(X110,#REF!,5,FALSE)","v":{"$error":"#REF!"}},{"$f":"T110-HLOOKUP(X110,#REF!,6,FALSE)","v":{"$error":"#REF!"}},{"$f":"T110-HLOOKUP(X110,#REF!,7,FALSE)","v":{"$error":"#REF!"}},{"$f":"T110-HLOOKUP(X110,#REF!,8,FALSE)","v":{"$error":"#REF!"}},{"$f":"T110-HLOOKUP(X110,#REF!,9,FALSE)","v":{"$error":"#REF!"}},null,null,null,null,null,null,null,{"$error":"#REF!"}]
["H","N","IDF",17,380705,"BEKKOUCH","ILIES",2002,54.3,"CACHAN","F",22,24,26,50,33,35,37,72,122,195.13301116266209,67.7,null,{"$f":"IF(A111=\"F\",(IF(OR(H111>2001,H111<2004),VLOOKUP(I111,Feuil1!$G$11:$H$25,2))),IF(A111=\"H\",(IF(OR(H111>2001,H111<2004),VLOOKUP(I111,Feuil1!$A$11:$F$29,2)))))","v":"M56"},null,{"$f":"T111-HLOOKUP(X111,#REF!,2,FALSE)","v":{"$error":"#REF!"}},{"$f":"T111-HLOOKUP(X111,#REF!,3,FALSE)","v":{"$error":"#REF!"}},{"$f":"T111-HLOOKUP(X111,#REF!,4,FALSE)","v":{"$error":"#REF!"}},{"$f":"T111-HLOOKUP(X111,#REF!,5,FALSE)","v":{"$error":"#REF!"}},{"$f":"T111-HLOOKUP(X111,#REF!,6,FALSE)","v":{"$error":"#REF!"}},{"$f":"T111-HLOOKUP(X111,#REF!,7,FALSE)","v":{"$error":"#REF!"}},{"$f":"T111-HLOOKUP(X111,#REF!,8,FALSE)","v":{"$error":"#REF!"}},{"$f":"T111-HLOOKUP(X111,#REF!,9,FALSE)","v":{"$error":"#REF!"}},null,null,null,null,null,null,null,{"$error":"#REF!"}]
["H","SEST","LAN",18,383010,"GARIDEL","Théo",2002,55,"HC Grand Combe","F",24,26,28,54,32,34,-36,66,120,189.97583798788483,65,null,{"$f":"IF(A112=\"F\",(IF(OR(H112>2001,H112<2004),VLOOKUP(I112,Feuil1!$G$11:$H$25,2))),IF(A112=\"H\",(IF(OR(H112>2001,H112<2004),VLOOKUP(I112,Feuil1!$A$11:$F$29,2)))))","v":"M56"},null,{"$f":"T112-HLOOKUP(X112,#REF!,2,FALSE)","v":{"$error":"#REF!"}},{"$f":"T112-HLOOKUP(X112,#REF!,3,FALSE)","v":{"$error":"#REF!"}},{"$f":"T112-HLOOKUP(X112,#REF!,4,FALSE)","v":{"$error":"#REF!"}},{"$f":"T112-HLOOKUP(X112,#REF!,5,FALSE)","v":{"$error":"#REF!"}},{"$f":"T112-HLOOKUP(X112,#REF!,6,FALSE)","v":{"$error":"#REF!"}},{"$f":"T112-HLOOKUP(X112,#REF!,7,FALSE)","v":{"$error":"#REF!"}},{"$f":"T112-HLOOKUP(X112,#REF!,8,FALSE)","v":{"$error":"#REF!"}},{"$f":"T112-HLOOKUP(X112,#REF!,9,FALSE)","v":{"$error":"#REF!"}},null,null,null,null,null,null,null,{"$error":"#REF!"}]
["H","ZCO","BRE",19,327176,"FETIVEAU","Brian",2003,50.4,"ES Saint-Avé","F",26,28,-30,54,28,30,-32,58,112,190.58122304663459,61.6,null,{"$f":"IF(A113=\"F\",(IF(OR(H113>2001,H113<2004),VLOOKUP(I113,Feuil1!$G$11:$H$25,2))),IF(A113=\"H\",(IF(OR(H113>2001,H113<2004),VLOOKUP(I113,Feuil1!$A$11:$F$29,2)))))","v":"M56"},null,{"$f":"T113-HLOOKUP(X113,#REF!,2,FALSE)","v":{"$error":"#REF!"}},{"$f":"T113-HLOOKUP(X113,#REF!,3,FALSE)","v":{"$error":"#REF!"}},{"$f":"T113-HLOOKUP(X113,#REF!,4,FALSE)","v":{"$error":"#REF!"}},{"$f":"T113-HLOOKUP(X113,#REF!,5,FALSE)","v":{"$error":"#REF!"}},{"$f":"T113-HLOOKUP(X113,#REF!,6,FALSE)","v":{"$error":"#REF!"}},{"$f":"T113-HLOOKUP(X113,#REF!,7,FALSE)","v":{"$error":"#REF!"}},{"$f":"T113-HLOOKUP(X113,#REF!,8,FALSE)","v":{"$error":"#REF!"}},{"$f":"T113-HLOOKUP(X113,#REF!,9,FALSE)","v":{"$error":"#REF!"}},null,null,null,null,null,null,null,{"$error":"#REF!"}]
["H","SEST","CAZ",20,378543,"GATEAU","Raphael",2002,53.35,"ASPTT DRAGUIGNAN","F",18,20,22,42,25,-27,27,52,94,152.51637397404875,40.65,null,{"$f":"IF(A114=\"F\",(IF(OR(H114>2001,H114<2004),VLOOKUP(I114,Feuil1!$G$11:$H$25,2))),IF(A114=\"H\",(IF(OR(H114>2001,H114<2004),VLOOKUP(I114,Feuil1!$A$11:$F$29,2)))))","v":"M56"},null,{"$f":"T114-HLOOKUP(X114,#REF!,2,FALSE)","v":{"$error":"#REF!"}},{"$f":"T114-HLOOKUP(X114,#REF!,3,FALSE)","v":{"$error":"#REF!"}},{"$f":"T114-HLOOKUP(X114,#REF!,4,FALSE)","v":{"$error":"#REF!"}},{"$f":"T114-HLOOKUP(X114,#REF!,5,FALSE)","v":{"$error":"#REF!"}},{"$f":"T114-HLOOKUP(X114,#REF!,6,FALSE)","v":{"$error":"#REF!"}},{"$f":"T114-HLOOKUP(X114,#REF!,7,FALSE)","v":{"$error":"#REF!"}},{"$f":"T114-HLOOKUP(X114,#REF!,8,FALSE)","v":{"$error":"#REF!"}},{"$f":"T114-HLOOKUP(X114,#REF!,9,FALSE)","v":{"$error":"#REF!"}},null,null,null,null,null,null,null,{"$error":"#REF!"}]
["H","N","IDF",21,386891,"PHILIBERT","MAEDÏN",2002,55.9,"FRANCONVILLE","F",15,17,19,36,21,23,25,48,84,131.28747442749838,28.1,null,{"$f":"IF(A115=\"F\",(IF(OR(H115>2001,H115<2004),VLOOKUP(I115,Feuil1!$G$11:$H$25,2))),IF(A115=\"H\",(IF(OR(H115>2001,H115<2004),VLOOKUP(I115,Feuil1!$A$11:$F$29,2)))))","v":"M56"},null,{"$f":"T115-HLOOKUP(X115,#REF!,2,FALSE)","v":{"$error":"#REF!"}},{"$f":"T115-HLOOKUP(X115,#REF!,3,FALSE)","v":{"$error":"#REF!"}},{"$f":"T115-HLOOKUP(X115,#REF!,4,FALSE)","v":{"$error":"#REF!"}},{"$f":"T115-HLOOKUP(X115,#REF!,5,FALSE)","v":{"$error":"#REF!"}},{"$f":"T115-HLOOKUP(X115,#REF!,6,FALSE)","v":{"$error":"#REF!"}},{"$f":"T115-HLOOKUP(X115,#REF!,7,FALSE)","v":{"$error":"#REF!"}},{"$f":"T115-HLOOKUP(X115,#REF!,8,FALSE)","v":{"$error":"#REF!"}},{"$f":"T115-HLOOKUP(X115,#REF!,9,FALSE)","v":{"$error":"#REF!"}},null,null,null,null,null,null,null,{"$error":"#REF!"}]
["H","ZCO","CEN",22,381199,"AUBRY","Tanguy",2003,53.7,"AAJ BLOIS","F",15,17,19,36,20,22,24,46,82,132.33906576915706,28.299999999999997,null,{"$f":"IF(A116=\"F\",(IF(OR(H116>2001,H116<2004),VLOOKUP(I116,Feuil1!$G$11:$H$25,2))),IF(A116=\"H\",(IF(OR(H116>2001,H116<2004),VLOOKUP(I116,Feuil1!$A$11:$F$29,2)))))","v":"M56"},null,{"$f":"T116-HLOOKUP(X116,#REF!,2,FALSE)","v":{"$error":"#REF!"}},{"$f":"T116-HLOOKUP(X116,#REF!,3,FALSE)","v":{"$error":"#REF!"}},{"$f":"T116-HLOOKUP(X116,#REF!,4,FALSE)","v":{"$error":"#REF!"}},{"$f":"T116-HLOOKUP(X116,#REF!,5,FALSE)","v":{"$error":"#REF!"}},{"$f":"T116-HLOOKUP(X116,#REF!,6,FALSE)","v":{"$error":"#REF!"}},{"$f":"T116-HLOOKUP(X116,#REF!,7,FALSE)","v":{"$error":"#REF!"}},{"$f":"T116-HLOOKUP(X116,#REF!,8,FALSE)","v":{"$error":"#REF!"}},{"$f":"T116-HLOOKUP(X116,#REF!,9,FALSE)","v":{"$error":"#REF!"}},null,null,null,null,null,null,null,{"$error":"#REF!"}]
["H","CO","HNO",23,375036,"DUBUISSON","Florian",2002,53.8,"CHM Le Trait","F",12,14,16,30,20,22,24,46,76,122.470546864239,22.200000000000003,null,{"$f":"IF(A117=\"F\",(IF(OR(H117>2001,H117<2004),VLOOKUP(I117,Feuil1!$G$11:$H$25,2))),IF(A117=\"H\",(IF(OR(H117>2001,H117<2004),VLOOKUP(I117,Feuil1!$A$11:$F$29,2)))))","v":"M56"},null,{"$f":"T117-HLOOKUP(X117,#REF!,2,FALSE)","v":{"$error":"#REF!"}},{"$f":"T117-HLOOKUP(X117,#REF!,3,FALSE)","v":{"$error":"#REF!"}},{"$f":"T117-HLOOKUP(X117,#REF!,4,FALSE)","v":{"$error":"#REF!"}},{"$f":"T117-HLOOKUP(X117,#REF!,5,FALSE)","v":{"$error":"#REF!"}},{"$f":"T117-HLOOKUP(X117,#REF!,6,FALSE)","v":{"$error":"#REF!"}},{"$f":"T117-HLOOKUP(X117,#REF!,7,FALSE)","v":{"$error":"#REF!"}},{"$f":"T117-HLOOKUP(X117,#REF!,8,FALSE)","v":{"$error":"#REF!"}},{"$f":"T117-HLOOKUP(X117,#REF!,9,FALSE)","v":{"$error":"#REF!"}},null,null,null,null,null,null,null,{"$error":"#REF!"}]
["H","SEST","CAZ",24,391431,"TURKY","Skander",2002,54.4,"ES VILLENEUVE LOUBET","F",14,16,17,33,20,22,-24,42,75,119.78140301046156,20.6,null,{"$f":"IF(A118=\"F\",(IF(OR(H118>2001,H118<2004),VLOOKUP(I118,Feuil1!$G$11:$H$25,2))),IF(A118=\"H\",(IF(OR(H118>2001,H118<2004),VLOOKUP(I118,Feuil1!$A$11:$F$29,2)))))","v":"M56"},null,{"$f":"T118-HLOOKUP(X118,#REF!,2,FALSE)","v":{"$error":"#REF!"}},{"$f":"T118-HLOOKUP(X118,#REF!,3,FALSE)","v":{"$error":"#REF!"}},{"$f":"T118-HLOOKUP(X118,#REF!,4,FALSE)","v":{"$error":"#REF!"}},{"$f":"T118-HLOOKUP(X118,#REF!,5,FALSE)","v":{"$error":"#REF!"}},{"$f":"T118-HLOOKUP(X118,#REF!,6,FALSE)","v":{"$error":"#REF!"}},{"$f":"T118-HLOOKUP(X118,#REF!,7,FALSE)","v":{"$error":"#REF!"}},{"$f":"T118-HLOOKUP(X118,#REF!,8,FALSE)","v":{"$error":"#REF!"}},{"$f":"T118-HLOOKUP(X118,#REF!,9,FALSE)","v":{"$error":"#REF!"}},null,null,null,null,null,null,null,{"$error":"#REF!"}]
["H","N","IDF",25,377315,"CAGNY","RAFAEL",2003,50.7,"FRANCONVILLE","F",21,-23,-23,21,20,22,23,45,66,111.73874837601387,15.299999999999997,null,{"$f":"IF(A119=\"F\",(IF(OR(H119>2001,H119<2004),VLOOKUP(I119,Feuil1!$G$11:$H$25,2))),IF(A119=\"H\",(IF(OR(H119>2001,H119<2004),VLOOKUP(I119,Feuil1!$A$11:$F$29,2)))))","v":"M56"},null,{"$f":"T119-HLOOKUP(X119,#REF!,2,FALSE)","v":{"$error":"#REF!"}},{"$f":"T119-HLOOKUP(X119,#REF!,3,FALSE)","v":{"$error":"#REF!"}},{"$f":"T119-HLOOKUP(X119,#REF!,4,FALSE)","v":{"$error":"#REF!"}},{"$f":"T119-HLOOKUP(X119,#REF!,5,FALSE)","v":{"$error":"#REF!"}},{"$f":"T119-HLOOKUP(X119,#REF!,6,FALSE)","v":{"$error":"#REF!"}},{"$f":"T119-HLOOKUP(X119,#REF!,7,FALSE)","v":{"$error":"#REF!"}},{"$f":"T119-HLOOKUP(X119,#REF!,8,FALSE)","v":{"$error":"#REF!"}},{"$f":"T119-HLOOKUP(X119,#REF!,9,FALSE)","v":{"$error":"#REF!"}},null,null,null,null,null,null,null,{"$error":"#REF!"}]
[null,null,null,null,null,null,null,null,null,null,null,null,null,null,null,null,null,null,null,null,null,null,null,null,null,null," ",{"$f":"T120-HLOOKUP(X120,[1]Feuil1!$C$1:$BL$10,2,FALSE)","v":{"$error":"#N/A"}},{"$f":"T120-HLOOKUP(X120,[1]Feuil1!$C$1:$BL$10,3,FALSE)","v":{"$error":"#N/A"}},{"$f":"T120-HLOOKUP(X120,[1]Feuil1!$C$1:$BL$10,4,FALSE)","v":{"$error":"#N/A"}},{"$f":"T120-HLOOKUP(X120,[1]Feuil1!$C$1:$BL$10,5,FALSE)","v":{"$error":"#N/A"}},{"$f":"T120-HLOOKUP(X120,[1]Feuil1!$C$1:$BL$10,6,FALSE)","v":{"$error":"#N/A"}},{"$f":"T120-HLOOKUP(X120,[1]Feuil1!$C$1:$BL$10,7,FALSE)","v":{"$error":"#N/A"}},{"$f":"T120-HLOOKUP(X120,[1]Feuil1!$C$1:$BL$10,8,FALSE)","v":{"$error":"#N/A"}},{"$f":"T120-HLOOKUP(X120,[1]Feuil1!$C$1:$BL$10,9,FALSE)","v":{"$error":"#N/A"}},{"$f":"T120-HLOOKUP(X120,[1]Feuil1!$C$1:$BL$10,10,FALSE)","v":{"$error":"#N/A"}},null,null,null,null,null,null,{"$f":"IF(AJ120>=0,$AJ$4,IF(AI120>=0,$AI$4,IF(AH120>=0,$AH$4,IF(AG120>=0,$AG$4,IF(AF120>=0,$AF$4,IF(AE120>=0,$AE$4,IF(AD120>=0,$AD$4,IF(AC120>=0,$AC$4,$AB$4))))))))","v":{"$error":"#N/A"}}]
["H","NE","BOU",1,363266,"GRAILLOT","Jessy",2003,60.28,"HMDB21","F",39,41,43,{"$f":"IF(MAXA(L121+M121,M121+N121,L121+N121,L121,M121,N121)<=0,0,MAXA(L121+M121,M121+N121,L121+N121,L121,M121,N121))","v":84},49,51,53,{"$f":"IF(MAXA(P121+Q121,Q121+R121,P121+R121,P121,Q121,R121)<=0,0,MAXA(P121+Q121,Q121+R121,P121+R121,P121,Q121,R121))","v":104},{"$f":"IF(H121=\"\",\"\",IF(OR(O121=0,S121=0),0,O121+S121))","v":188},{"$f":"IF(I121=\"\",\"\",IF(A121=\"H\",10^(0.794358141*LOG(I121/174.393)^2)*T121,IF(A121=\"F\",10^(0.89726074 * LOG(I121/148.026)^2)*T121,\"\")))","v":277.48296555026047},{"$f":"SUM(T121-I121)","v":127.72},null,{"$f":"IF(A121=\"F\",(IF(OR(H121>2001,H121<2004),VLOOKUP(I121,Feuil1!$G$11:$H$25,2))),IF(A121=\"H\",(IF(OR(H121>2001,H121<2004),VLOOKUP(I121,Feuil1!$A$11:$F$29,2)))))","v":"M62"},null,{"$f":"T121-HLOOKUP(X121,#REF!,2,FALSE)","v":{"$error":"#REF!"}},{"$f":"T121-HLOOKUP(X121,#REF!,3,FALSE)","v":{"$error":"#REF!"}},{"$f":"T121-HLOOKUP(X121,#REF!,4,FALSE)","v":{"$error":"#REF!"}},{"$f":"T121-HLOOKUP(X121,#REF!,5,FALSE)","v":{"$error":"#REF!"}},{"$f":"T121-HLOOKUP(X121,#REF!,6,FALSE)","v":{"$error":"#REF!"}},{"$f":"T121-HLOOKUP(X121,#REF!,7,FALSE)","v":{"$error":"#REF!"}},{"$f":"T121-HLOOKUP(X121,#REF!,8,FALSE)","v":{"$error":"#REF!"}},{"$f":"T121-HLOOKUP(X121,#REF!,9,FALSE)","v":{"$error":"#REF!"}},null,null,null,null,null,null,null,{"$f":"IF(AG121>=0,$AG$4,IF(AF121>=0,$AF$4,IF(AE121>=0,$AE$4,IF(AD121>=0,$AD$4,IF(AC121>=0,$AC$4,IF(AB121>=0,$AB$4,IF(AA121>=0,$AA$4,IF(Z121>=0,$Z$4,$AH$4))))))))","v":{"$error":"#REF!"}}]
["H","ZCO","BRE",2,360832,"BERTHE","Thibaut",2002,60.7,"AL QUIMPER","F",38,39,41,80,48,49,51,100,180,264.33093571082617,119.3,null,{"$f":"IF(A122=\"F\",(IF(OR(H122>2001,H122<2004),VLOOKUP(I122,Feuil1!$G$11:$H$25,2))),IF(A122=\"H\",(IF(OR(H122>2001,H122<2004),VLOOKUP(I122,Feuil1!$A$11:$F$29,2)))))","v":"M62"},null,{"$f":"T122-HLOOKUP(X122,#REF!,2,FALSE)","v":{"$error":"#REF!"}},{"$f":"T122-HLOOKUP(X122,#REF!,3,FALSE)","v":{"$error":"#REF!"}},{"$f":"T122-HLOOKUP(X122,#REF!,4,FALSE)","v":{"$error":"#REF!"}},{"$f":"T122-HLOOKUP(X122,#REF!,5,FALSE)","v":{"$error":"#REF!"}},{"$f":"T122-HLOOKUP(X122,#REF!,6,FALSE)","v":{"$error":"#REF!"}},{"$f":"T122-HLOOKUP(X122,#REF!,7,FALSE)","v":{"$error":"#REF!"}},{"$f":"T122-HLOOKUP(X122,#REF!,8,FALSE)","v":{"$error":"#REF!"}},{"$f":"T122-HLOOKUP(X122,#REF!,9,FALSE)","v":{"$error":"#REF!"}},null,null,null,null,null,null,null,{"$error":"#REF!"}]
["H","NORD","PIC",3,376294,"HULOT","Charles",2002,60.64,"Roisel CHFM","F",34,36,38,74,45,47,49,96,170,249.82581060248907,109.36,null,{"$f":"IF(A123=\"F\",(IF(OR(H123>2001,H123<2004),VLOOKUP(I123,Feuil1!$G$11:$H$25,2))),IF(A123=\"H\",(IF(OR(H123>2001,H123<2004),VLOOKUP(I123,Feuil1!$A$11:$F$29,2)))))","v":"M62"},null,{"$f":"T123-HLOOKUP(X123,#REF!,2,FALSE)","v":{"$error":"#REF!"}},{"$f":"T123-HLOOKUP(X123,#REF!,3,FALSE)","v":{"$error":"#REF!"}},{"$f":"T123-HLOOKUP(X123,#REF!,4,FALSE)","v":{"$error":"#REF!"}},{"$f":"T123-HLOOKUP(X123,#REF!,5,FALSE)","v":{"$error":"#REF!"}},{"$f":"T123-HLOOKUP(X123,#REF!,6,FALSE)","v":{"$error":"#REF!"}},{"$f":"T123-HLOOKUP(X123,#REF!,7,FALSE)","v":{"$error":"#REF!"}},{"$f":"T123-HLOOKUP(X123,#REF!,8,FALSE)","v":{"$error":"#REF!"}},{"$f":"T123-HLOOKUP(X123,#REF!,9,FALSE)","v":{"$error":"#REF!"}},null,null,null,null,null,null,null,{"$error":"#REF!"}]
["H","ZCO","CEN",4,346360,"PINIAU","Mathis",2002,59.69,"CM ORLEANS","F",32,34,36,70,-44,44,46,90,160,237.87233170683334,100.31,null,{"$f":"IF(A124=\"F\",(IF(OR(H124>2001,H124<2004),VLOOKUP(I124,Feuil1!$G$11:$H$25,2))),IF(A124=\"H\",(IF(OR(H124>2001,H124<2004),VLOOKUP(I124,Feuil1!$A$11:$F$29,2)))))","v":"M62"},null,{"$f":"T124-HLOOKUP(X124,#REF!,2,FALSE)","v":{"$error":"#REF!"}},{"$f":"T124-HLOOKUP(X124,#REF!,3,FALSE)","v":{"$error":"#REF!"}},{"$f":"T124-HLOOKUP(X124,#REF!,4,FALSE)","v":{"$error":"#REF!"}},{"$f":"T124-HLOOKUP(X124,#REF!,5,FALSE)","v":{"$error":"#REF!"}},{"$f":"T124-HLOOKUP(X124,#REF!,6,FALSE)","v":{"$error":"#REF!"}},{"$f":"T124-HLOOKUP(X124,#REF!,7,FALSE)","v":{"$error":"#REF!"}},{"$f":"T124-HLOOKUP(X124,#REF!,8,FALSE)","v":{"$error":"#REF!"}},{"$f":"T124-HLOOKUP(X124,#REF!,9,FALSE)","v":{"$error":"#REF!"}},null,null,null,null,null,null,null,{"$error":"#REF!"}]
["H","SEST","LAN",5,374525,"DELLACHI","Yann",2002,60,"HC Grand Combe","F",33,35,37,72,39,41,43,84,156,231.04063594738241,96,null,{"$f":"IF(A125=\"F\",(IF(OR(H125>2001,H125<2004),VLOOKUP(I125,Feuil1!$G$11:$H$25,2))),IF(A125=\"H\",(IF(OR(H125>2001,H125<2004),VLOOKUP(I125,Feuil1!$A$11:$F$29,2)))))","v":"M62"},null,{"$f":"T125-HLOOKUP(X125,#REF!,2,FALSE)","v":{"$error":"#REF!"}},{"$f":"T125-HLOOKUP(X125,#REF!,3,FALSE)","v":{"$error":"#REF!"}},{"$f":"T125-HLOOKUP(X125,#REF!,4,FALSE)","v":{"$error":"#REF!"}},{"$f":"T125-HLOOKUP(X125,#REF!,5,FALSE)","v":{"$error":"#REF!"}},{"$f":"T125-HLOOKUP(X125,#REF!,6,FALSE)","v":{"$error":"#REF!"}},{"$f":"T125-HLOOKUP(X125,#REF!,7,FALSE)","v":{"$error":"#REF!"}},{"$f":"T125-HLOOKUP(X125,#REF!,8,FALSE)","v":{"$error":"#REF!"}},{"$f":"T125-HLOOKUP(X125,#REF!,9,FALSE)","v":{"$error":"#REF!"}},null,null,null,null,null,null,null,{"$error":"#REF!"}]
["H","N","IDF",6,380705,"BEKKOUCH","ILIES",2002,56.45,"CACHAN","F",28,30,32,62,38,40,42,82,144,223.3484188763621,87.55,null,{"$f":"IF(A126=\"F\",(IF(OR(H126>2001,H126<2004),VLOOKUP(I126,Feuil1!$G$11:$H$25,2))),IF(A126=\"H\",(IF(OR(H126>2001,H126<2004),VLOOKUP(I126,Feuil1!$A$11:$F$29,2)))))","v":"M62"},null,{"$f":"T126-HLOOKUP(X126,#REF!,2,FALSE)","v":{"$error":"#REF!"}},{"$f":"T126-HLOOKUP(X126,#REF!,3,FALSE)","v":{"$error":"#REF!"}},{"$f":"T126-HLOOKUP(X126,#REF!,4,FALSE)","v":{"$error":"#REF!"}},{"$f":"T126-HLOOKUP(X126,#REF!,5,FALSE)","v":{"$error":"#REF!"}},{"$f":"T126-HLOOKUP(X126,#REF!,6,FALSE)","v":{"$error":"#REF!"}},{"$f":"T126-HLOOKUP(X126,#REF!,7,FALSE)","v":{"$error":"#REF!"}},{"$f":"T126-HLOOKUP(X126,#REF!,8,FALSE)","v":{"$error":"#REF!"}},{"$f":"T126-HLOOKUP(X126,#REF!,9,FALSE)","v":{"$error":"#REF!"}},null,null,null,null,null,null,null,{"$error":"#REF!"}]
["H","SEST","CAZ",7,392293,"ABDOU LATIOFO","Dayane",2002,60.05,"HC NICE","F",30,-32,32,62,36,38,-40,74,136,201.2966119592291,75.95,null,{"$f":"IF(A127=\"F\",(IF(OR(H127>2001,H127<2004),VLOOKUP(I127,Feuil1!$G$11:$H$25,2))),IF(A127=\"H\",(IF(OR(H127>2001,H127<2004),VLOOKUP(I127,Feuil1!$A$11:$F$29,2)))))","v":"M62"},null,{"$f":"T127-HLOOKUP(X127,#REF!,2,FALSE)","v":{"$error":"#REF!"}},{"$f":"T127-HLOOKUP(X127,#REF!,3,FALSE)","v":{"$error":"#REF!"}},{"$f":"T127-HLOOKUP(X127,#REF!,4,FALSE)","v":{"$error":"#REF!"}},{"$f":"T127-HLOOKUP(X127,#REF!,5,FALSE)","v":{"$error":"#REF!"}},{"$f":"T127-HLOOKUP(X127,#REF!,6,FALSE)","v":{"$error":"#REF!"}},{"$f":"T127-HLOOKUP(X127,#REF!,7,FALSE)","v":{"$error":"#REF!"}},{"$f":"T127-HLOOKUP(X127,#REF!,8,FALSE)","v":{"$error":"#REF!"}},{"$f":"T127-HLOOKUP(X127,#REF!,9,FALSE)","v":{"$error":"#REF!"}},null,null,null,null,null,null,null,{"$error":"#REF!"}]
["H","SEST","CAZ",8,391430,"PARISOT","Lucas",2002,56.1,"ES VILLENEUVE LOUBET","F",24,26,28,54,-36,37,39,76,130,202.61503806770298,73.900000000000006,null,{"$f":"IF(A128=\"F\",(IF(OR(H128>2001,H128<2004),VLOOKUP(I128,Feuil1!$G$11:$H$25,2))),IF(A128=\"H\",(IF(OR(H128>2001,H128<2004),VLOOKUP(I128,Feuil1!$A$11:$F$29,2)))))","v":"M62"},null,{"$f":"T128-HLOOKUP(X128,#REF!,2,FALSE)","v":{"$error":"#REF!"}},{"$f":"T128-HLOOKUP(X128,#REF!,3,FALSE)","v":{"$error":"#REF!"}},{"$f":"T128-HLOOKUP(X128,#REF!,4,FALSE)","v":{"$error":"#REF!"}},{"$f":"T128-HLOOKUP(X128,#REF!,5,FALSE)","v":{"$error":"#REF!"}},{"$f":"T128-HLOOKUP(X128,#REF!,6,FALSE)","v":{"$error":"#REF!"}},{"$f":"T128-HLOOKUP(X128,#REF!,7,FALSE)","v":{"$error":"#REF!"}},{"$f":"T128-HLOOKUP(X128,#REF!,8,FALSE)","v":{"$error":"#REF!"}},{"$f":"T128-HLOOKUP(X128,#REF!,9,FALSE)","v":{"$error":"#REF!"}},null,null,null,null,null,null,null,{"$error":"#REF!"}]
["H","ZCO","BRE",9,380250,"RATON","Killian",2002,59.81,"AL QUIMPER","F",25,26,27,53,35,36,-38,71,124,184.0776279132225,64.19,null,{"$f":"IF(A129=\"F\",(IF(OR(H129>2001,H129<2004),VLOOKUP(I129,Feuil1!$G$11:$H$25,2))),IF(A129=\"H\",(IF(OR(H129>2001,H129<2004),VLOOKUP(I129,Feuil1!$A$11:$F$29,2)))))","v":"M62"},null,{"$f":"T129-HLOOKUP(X129,#REF!,2,FALSE)","v":{"$error":"#REF!"}},{"$f":"T129-HLOOKUP(X129,#REF!,3,FALSE)","v":{"$error":"#REF!"}},{"$f":"T129-HLOOKUP(X129,#REF!,4,FALSE)","v":{"$error":"#REF!"}},{"$f":"T129-HLOOKUP(X129,#REF!,5,FALSE)","v":{"$error":"#REF!"}},{"$f":"T129-HLOOKUP(X129,#REF!,6,FALSE)","v":{"$error":"#REF!"}},{"$f":"T129-HLOOKUP(X129,#REF!,7,FALSE)","v":{"$error":"#REF!"}},{"$f":"T129-HLOOKUP(X129,#REF!,8,FALSE)","v":{"$error":"#REF!"}},{"$f":"T129-HLOOKUP(X129,#REF!,9,FALSE)","v":{"$error":"#REF!"}},null,null,null,null,null,null,null,{"$error":"#REF!"}]
["H","ZCO","CEN",10,381199,"AUBRY","Tanguy",2003,59.69,"AAJ BLOIS","F",23,25,26,51,33,35,37,72,123,182.86435499962812,63.31,null,{"$f":"IF(A130=\"F\",(IF(OR(H130>2001,H130<2004),VLOOKUP(I130,Feuil1!$G$11:$H$25,2))),IF(A130=\"H\",(IF(OR(H130>2001,H130<2004),VLOOKUP(I130,Feuil1!$A$11:$F$29,2)))))","v":"M62"},null,{"$f":"T130-HLOOKUP(X130,#REF!,2,FALSE)","v":{"$error":"#REF!"}},{"$f":"T130-HLOOKUP(X130,#REF!,3,FALSE)","v":{"$error":"#REF!"}},{"$f":"T130-HLOOKUP(X130,#REF!,4,FALSE)","v":{"$error":"#REF!"}},{"$f":"T130-HLOOKUP(X130,#REF!,5,FALSE)","v":{"$error":"#REF!"}},{"$f":"T130-HLOOKUP(X130,#REF!,6,FALSE)","v":{"$error":"#REF!"}},{"$f":"T130-HLOOKUP(X130,#REF!,7,FALSE)","v":{"$error":"#REF!"}},{"$f":"T130-HLOOKUP(X130,#REF!,8,FALSE)","v":{"$error":"#REF!"}},{"$f":"T130-HLOOKUP(X130,#REF!,9,FALSE)","v":{"$error":"#REF!"}},null,null,null,null,null,null,null,{"$error":"#REF!"}]
["H","DOM","REU",11,374356,"BARDEUR","JULIEN",2002,56.23,"CH TAMPON","F",23,25,27,52,30,32,34,66,118,183.57963354684307,61.77,null,{"$f":"IF(A131=\"F\",(IF(OR(H131>2001,H131<2004),VLOOKUP(I131,Feuil1!$G$11:$H$25,2))),IF(A131=\"H\",(IF(OR(H131>2001,H131<2004),VLOOKUP(I131,Feuil1!$A$11:$F$29,2)))))","v":"M62"},null,{"$f":"T131-HLOOKUP(X131,#REF!,2,FALSE)","v":{"$error":"#REF!"}},{"$f":"T131-HLOOKUP(X131,#REF!,3,FALSE)","v":{"$error":"#REF!"}},{"$f":"T131-HLOOKUP(X131,#REF!,4,FALSE)","v":{"$error":"#REF!"}},{"$f":"T131-HLOOKUP(X131,#REF!,5,FALSE)","v":{"$error":"#REF!"}},{"$f":"T131-HLOOKUP(X131,#REF!,6,FALSE)","v":{"$error":"#REF!"}},{"$f":"T131-HLOOKUP(X131,#REF!,7,FALSE)","v":{"$error":"#REF!"}},{"$f":"T131-HLOOKUP(X131,#REF!,8,FALSE)","v":{"$error":"#REF!"}},{"$f":"T131-HLOOKUP(X131,#REF!,9,FALSE)","v":{"$error":"#REF!"}},null,null,null,null,null,null,null,{"$error":"#REF!"}]
["H","SO","MPY",12,368450,"DURETELLE DE ST SAUVEUR","Valentin",2003,60,"ALBI HC","F",20,22,24,46,32,34,36,70,116,171.7994472429254,56,null,{"$f":"IF(A132=\"F\",(IF(OR(H132>2001,H132<2004),VLOOKUP(I132,Feuil1!$G$11:$H$25,2))),IF(A132=\"H\",(IF(OR(H132>2001,H132<2004),VLOOKUP(I132,Feuil1!$A$11:$F$29,2)))))","v":"M62"},null,{"$f":"T132-HLOOKUP(X132,#REF!,2,FALSE)","v":{"$error":"#REF!"}},{"$f":"T132-HLOOKUP(X132,#REF!,3,FALSE)","v":{"$error":"#REF!"}},{"$f":"T132-HLOOKUP(X132,#REF!,4,FALSE)","v":{"$error":"#REF!"}},{"$f":"T132-HLOOKUP(X132,#REF!,5,FALSE)","v":{"$error":"#REF!"}},{"$f":"T132-HLOOKUP(X132,#REF!,6,FALSE)","v":{"$error":"#REF!"}},{"$f":"T132-HLOOKUP(X132,#REF!,7,FALSE)","v":{"$error":"#REF!"}},{"$f":"T132-HLOOKUP(X132,#REF!,8,FALSE)","v":{"$error":"#REF!"}},{"$f":"T132-HLOOKUP(X132,#REF!,9,FALSE)","v":{"$error":"#REF!"}},null,null,null,null,null,null,null,{"$error":"#REF!"}]
["H","NORD","PIC",13,376940,"LEVIONNOIS","Nicolas",2002,61.9,"La Ferté Milon CMHM","F",20,22,24,46,25,27,29,56,102,147.68697134133424,40.1,null,{"$f":"IF(A133=\"F\",(IF(OR(H133>2001,H133<2004),VLOOKUP(I133,Feuil1!$G$11:$H$25,2))),IF(A133=\"H\",(IF(OR(H133>2001,H133<2004),VLOOKUP(I133,Feuil1!$A$11:$F$29,2)))))","v":"M62"},null,{"$f":"T133-HLOOKUP(X133,#REF!,2,FALSE)","v":{"$error":"#REF!"}},{"$f":"T133-HLOOKUP(X133,#REF!,3,FALSE)","v":{"$error":"#REF!"}},{"$f":"T133-HLOOKUP(X133,#REF!,4,FALSE)","v":{"$error":"#REF!"}},{"$f":"T133-HLOOKUP(X133,#REF!,5,FALSE)","v":{"$error":"#REF!"}},{"$f":"T133-HLOOKUP(X133,#REF!,6,FALSE)","v":{"$error":"#REF!"}},{"$f":"T133-HLOOKUP(X133,#REF!,7,FALSE)","v":{"$error":"#REF!"}},{"$f":"T133-HLOOKUP(X133,#REF!,8,FALSE)","v":{"$error":"#REF!"}},{"$f":"T133-HLOOKUP(X133,#REF!,9,FALSE)","v":{"$error":"#REF!"}},null,null,null,null,null,null,null,{"$error":"#REF!"}]
["H","N","IDF",14,335746,"FAOUZI","BASSAM",2002,61.8,"CACHAN","F",18,20,22,42,26,28,30,58,100,144.9586793921076,38.200000000000003,null,{"$f":"IF(A134=\"F\",(IF(OR(H134>2001,H134<2004),VLOOKUP(I134,Feuil1!$G$11:$H$25,2))),IF(A134=\"H\",(IF(OR(H134>2001,H134<2004),VLOOKUP(I134,Feuil1!$A$11:$F$29,2)))))","v":"M62"},null,{"$f":"T134-HLOOKUP(X134,#REF!,2,FALSE)","v":{"$error":"#REF!"}},{"$f":"T134-HLOOKUP(X134,#REF!,3,FALSE)","v":{"$error":"#REF!"}},{"$f":"T134-HLOOKUP(X134,#REF!,4,FALSE)","v":{"$error":"#REF!"}},{"$f":"T134-HLOOKUP(X134,#REF!,5,FALSE)","v":{"$error":"#REF!"}},{"$f":"T134-HLOOKUP(X134,#REF!,6,FALSE)","v":{"$error":"#REF!"}},{"$f":"T134-HLOOKUP(X134,#REF!,7,FALSE)","v":{"$error":"#REF!"}},{"$f":"T134-HLOOKUP(X134,#REF!,8,FALSE)","v":{"$error":"#REF!"}},{"$f":"T134-HLOOKUP(X134,#REF!,9,FALSE)","v":{"$error":"#REF!"}},null,null,null,null,null,null,null,{"$error":"#REF!"}]
["H","N","IDF",15,386891,"PHILIBERT","MAEDÏN",2002,56.1,"FRANCONVILLE","F",21,23,-24,44,24,26,28,54,98,152.74056715872996,41.9,null,{"$f":"IF(A135=\"F\",(IF(OR(H135>2001,H135<2004),VLOOKUP(I135,Feuil1!$G$11:$H$25,2))),IF(A135=\"H\",(IF(OR(H135>2001,H135<2004),VLOOKUP(I135,Feuil1!$A$11:$F$29,2)))))","v":"M62"},null,{"$f":"T135-HLOOKUP(X135,#REF!,2,FALSE)","v":{"$error":"#REF!"}},{"$f":"T135-HLOOKUP(X135,#REF!,3,FALSE)","v":{"$error":"#REF!"}},{"$f":"T135-HLOOKUP(X135,#REF!,4,FALSE)","v":{"$error":"#REF!"}},{"$f":"T135-HLOOKUP(X135,#REF!,5,FALSE)","v":{"$error":"#REF!"}},{"$f":"T135-HLOOKUP(X135,#REF!,6,FALSE)","v":{"$error":"#REF!"}},{"$f":"T135-HLOOKUP(X135,#REF!,7,FALSE)","v":{"$error":"#REF!"}},{"$f":"T135-HLOOKUP(X135,#REF!,8,FALSE)","v":{"$error":"#REF!"}},{"$f":"T135-HLOOKUP(X135,#REF!,9,FALSE)","v":{"$error":"#REF!"}},null,null,null,null,null,null,null,{"$error":"#REF!"}]
["H","NORD","PIC",16,379759,"MARCHANDISE","Timéo",2002,61.6,"La Vaillante Saint Quentin","F",18,20,22,42,24,26,28,54,96,139.48409252360611,34.4,null,{"$f":"IF(A136=\"F\",(IF(OR(H136>2001,H136<2004),VLOOKUP(I136,Feuil1!$G$11:$H$25,2))),IF(A136=\"H\",(IF(OR(H136>2001,H136<2004),VLOOKUP(I136,Feuil1!$A$11:$F$29,2)))))","v":"M62"},null,{"$f":"T136-HLOOKUP(X136,#REF!,2,FALSE)","v":{"$error":"#REF!"}},{"$f":"T136-HLOOKUP(X136,#REF!,3,FALSE)","v":{"$error":"#REF!"}},{"$f":"T136-HLOOKUP(X136,#REF!,4,FALSE)","v":{"$error":"#REF!"}},{"$f":"T136-HLOOKUP(X136,#REF!,5,FALSE)","v":{"$error":"#REF!"}},{"$f":"T136-HLOOKUP(X136,#REF!,6,FALSE)","v":{"$error":"#REF!"}},{"$f":"T136-HLOOKUP(X136,#REF!,7,FALSE)","v":{"$error":"#REF!"}},{"$f":"T136-HLOOKUP(X136,#REF!,8,FALSE)","v":{"$error":"#REF!"}},{"$f":"T136-HLOOKUP(X136,#REF!,9,FALSE)","v":{"$error":"#REF!"}},null,null,null,null,null,null,null,{"$error":"#REF!"}]
["H","SEST","RAL",17,380145,"DUFFEZ","Quentin",2002,59.5,"L'ARBRESLE","F",15,17,19,36,25,27,29,56,92,137.10003472884048,32.5,null,{"$f":"IF(A137=\"F\",(IF(OR(H137>2001,H137<2004),VLOOKUP(I137,Feuil1!$G$11:$H$25,2))),IF(A137=\"H\",(IF(OR(H137>2001,H137<2004),VLOOKUP(I137,Feuil1!$A$11:$F$29,2)))))","v":"M62"},null,{"$f":"T137-HLOOKUP(X137,#REF!,2,FALSE)","v":{"$error":"#REF!"}},{"$f":"T137-HLOOKUP(X137,#REF!,3,FALSE)","v":{"$error":"#REF!"}},{"$f":"T137-HLOOKUP(X137,#REF!,4,FALSE)","v":{"$error":"#REF!"}},{"$f":"T137-HLOOKUP(X137,#REF!,5,FALSE)","v":{"$error":"#REF!"}},{"$f":"T137-HLOOKUP(X137,#REF!,6,FALSE)","v":{"$error":"#REF!"}},{"$f":"T137-HLOOKUP(X137,#REF!,7,FALSE)","v":{"$error":"#REF!"}},{"$f":"T137-HLOOKUP(X137,#REF!,8,FALSE)","v":{"$error":"#REF!"}},{"$f":"T137-HLOOKUP(X137,#REF!,9,FALSE)","v":{"$error":"#REF!"}},null,null,null,null,null,null,null,{"$error":"#REF!"}]
["H","NORD","PIC",18,361096,"ROUSSEAU","Benjamin",2002,61.62,"La Vaillante Saint Quentin","F",17,19,21,40,22,24,26,50,90,130.73586540183175,28.380000000000003,null,{"$f":"IF(A138=\"F\",(IF(OR(H138>2001,H138<2004),VLOOKUP(I138,Feuil1!$G$11:$H$25,2))),IF(A138=\"H\",(IF(OR(H138>2001,H138<2004),VLOOKUP(I138,Feuil1!$A$11:$F$29,2)))))","v":"M62"},null,{"$f":"T138-HLOOKUP(X138,#REF!,2,FALSE)","v":{"$error":"#REF!"}},{"$f":"T138-HLOOKUP(X138,#REF!,3,FALSE)","v":{"$error":"#REF!"}},{"$f":"T138-HLOOKUP(X138,#REF!,4,FALSE)","v":{"$error":"#REF!"}},{"$f":"T138-HLOOKUP(X138,#REF!,5,FALSE)","v":{"$error":"#REF!"}},{"$f":"T138-HLOOKUP(X138,#REF!,6,FALSE)","v":{"$error":"#REF!"}},{"$f":"T138-HLOOKUP(X138,#REF!,7,FALSE)","v":{"$error":"#REF!"}},{"$f":"T138-HLOOKUP(X138,#REF!,8,FALSE)","v":{"$error":"#REF!"}},{"$f":"T138-HLOOKUP(X138,#REF!,9,FALSE)","v":{"$error":"#REF!"}},null,null,null,null,null,null,null,{"$error":"#REF!"}]
["H","SEST","PRO",19,377629,"CEBE","Albin",2003,56.9,"EEAR MONTEUX","F",20,20,20,40,22,23,25,48,88,135.6528210870149,31.1,null,{"$f":"IF(A139=\"F\",(IF(OR(H139>2001,H139<2004),VLOOKUP(I139,Feuil1!$G$11:$H$25,2))),IF(A139=\"H\",(IF(OR(H139>2001,H139<2004),VLOOKUP(I139,Feuil1!$A$11:$F$29,2)))))","v":"M62"},null,{"$f":"T139-HLOOKUP(X139,#REF!,2,FALSE)","v":{"$error":"#REF!"}},{"$f":"T139-HLOOKUP(X139,#REF!,3,FALSE)","v":{"$error":"#REF!"}},{"$f":"T139-HLOOKUP(X139,#REF!,4,FALSE)","v":{"$error":"#REF!"}},{"$f":"T139-HLOOKUP(X139,#REF!,5,FALSE)","v":{"$error":"#REF!"}},{"$f":"T139-HLOOKUP(X139,#REF!,6,FALSE)","v":{"$error":"#REF!"}},{"$f":"T139-HLOOKUP(X139,#REF!,7,FALSE)","v":{"$error":"#REF!"}},{"$f":"T139-HLOOKUP(X139,#REF!,8,FALSE)","v":{"$error":"#REF!"}},{"$f":"T139-HLOOKUP(X139,#REF!,9,FALSE)","v":{"$error":"#REF!"}},null,null,null,null,null,null,null,{"$error":"#REF!"}]
["H","SEST","PRO",20,374428,"BOGUCKI","Vicent",2002,60.7,"ISTRES SPORTS","F",15,17,18,35,20,22,24,46,81,118.94892106987177,20.299999999999997,null,{"$f":"IF(A140=\"F\",(IF(OR(H140>2001,H140<2004),VLOOKUP(I140,Feuil1!$G$11:$H$25,2))),IF(A140=\"H\",(IF(OR(H140>2001,H140<2004),VLOOKUP(I140,Feuil1!$A$11:$F$29,2)))))","v":"M62"},null,{"$f":"T140-HLOOKUP(X140,#REF!,2,FALSE)","v":{"$error":"#REF!"}},{"$f":"T140-HLOOKUP(X140,#REF!,3,FALSE)","v":{"$error":"#REF!"}},{"$f":"T140-HLOOKUP(X140,#REF!,4,FALSE)","v":{"$error":"#REF!"}},{"$f":"T140-HLOOKUP(X140,#REF!,5,FALSE)","v":{"$error":"#REF!"}},{"$f":"T140-HLOOKUP(X140,#REF!,6,FALSE)","v":{"$error":"#REF!"}},{"$f":"T140-HLOOKUP(X140,#REF!,7,FALSE)","v":{"$error":"#REF!"}},{"$f":"T140-HLOOKUP(X140,#REF!,8,FALSE)","v":{"$error":"#REF!"}},{"$f":"T140-HLOOKUP(X140,#REF!,9,FALSE)","v":{"$error":"#REF!"}},null,null,null,null,null,null,null,{"$error":"#REF!"}]
["H","SEST","CAZ",21,391438,"ISSOT","Ludwig",2002,58.3,"ES VILLENEUVE LOUBET","F",16,18,-20,34,20,22,24,46,80,121.05061328945533,21.700000000000003,null,{"$f":"IF(A141=\"F\",(IF(OR(H141>2001,H141<2004),VLOOKUP(I141,Feuil1!$G$11:$H$25,2))),IF(A141=\"H\",(IF(OR(H141>2001,H141<2004),VLOOKUP(I141,Feuil1!$A$11:$F$29,2)))))","v":"M62"},null,{"$f":"T141-HLOOKUP(X141,#REF!,2,FALSE)","v":{"$error":"#REF!"}},{"$f":"T141-HLOOKUP(X141,#REF!,3,FALSE)","v":{"$error":"#REF!"}},{"$f":"T141-HLOOKUP(X141,#REF!,4,FALSE)","v":{"$error":"#REF!"}},{"$f":"T141-HLOOKUP(X141,#REF!,5,FALSE)","v":{"$error":"#REF!"}},{"$f":"T141-HLOOKUP(X141,#REF!,6,FALSE)","v":{"$error":"#REF!"}},{"$f":"T141-HLOOKUP(X141,#REF!,7,FALSE)","v":{"$error":"#REF!"}},{"$f":"T141-HLOOKUP(X141,#REF!,8,FALSE)","v":{"$error":"#REF!"}},{"$f":"T141-HLOOKUP(X141,#REF!,9,FALSE)","v":{"$error":"#REF!"}},null,null,null,null,null,null,null,{"$error":"#REF!"}]
[null,null,null,null,null,null,null,null,null,null,null,null,null,null,null,null,null,null,null,null,null,null,null,null,null,null," ",{"$f":"T142-HLOOKUP(X142,[1]Feuil1!$C$1:$BL$10,2,FALSE)","v":{"$error":"#N/A"}},{"$f":"T142-HLOOKUP(X142,[1]Feuil1!$C$1:$BL$10,3,FALSE)","v":{"$error":"#N/A"}},{"$f":"T142-HLOOKUP(X142,[1]Feuil1!$C$1:$BL$10,4,FALSE)","v":{"$error":"#N/A"}},{"$f":"T142-HLOOKUP(X142,[1]Feuil1!$C$1:$BL$10,5,FALSE)","v":{"$error":"#N/A"}},{"$f":"T142-HLOOKUP(X142,[1]Feuil1!$C$1:$BL$10,6,FALSE)","v":{"$error":"#N/A"}},{"$f":"T142-HLOOKUP(X142,[1]Feuil1!$C$1:$BL$10,7,FALSE)","v":{"$error":"#N/A"}},{"$f":"T142-HLOOKUP(X142,[1]Feuil1!$C$1:$BL$10,8,FALSE)","v":{"$error":"#N/A"}},{"$f":"T142-HLOOKUP(X142,[1]Feuil1!$C$1:$BL$10,9,FALSE)","v":{"$error":"#N/A"}},{"$f":"T142-HLOOKUP(X142,[1]Feuil1!$C$1:$BL$10,10,FALSE)","v":{"$error":"#N/A"}},null,null,null,null,null,null,{"$f":"IF(AJ142>=0,$AJ$4,IF(AI142>=0,$AI$4,IF(AH142>=0,$AH$4,IF(AG142>=0,$AG$4,IF(AF142>=0,$AF$4,IF(AE142>=0,$AE$4,IF(AD142>=0,$AD$4,IF(AC142>=0,$AC$4,$AB$4))))))))","v":{"$error":"#N/A"}}]
["H","DOM","REU",1,321684,"ROUGET","TIZZIANO",2002,62.62,"LES DEUX PETITS NANOS","F",50,52,54,{"$f":"IF(MAXA(L143+M143,M143+N143,L143+N143,L143,M143,N143)<=0,0,MAXA(L143+M143,M143+N143,L143+N143,L143,M143,N143))","v":106},64,66,68,{"$f":"IF(MAXA(P143+Q143,Q143+R143,P143+R143,P143,Q143,R143)<=0,0,MAXA(P143+Q143,Q143+R143,P143+R143,P143,Q143,R143))","v":134},{"$f":"IF(H143=\"\",\"\",IF(OR(O143=0,S143=0),0,O143+S143))","v":240},{"$f":"IF(I143=\"\",\"\",IF(A143=\"H\",10^(0.794358141*LOG(I143/174.393)^2)*T143,IF(A143=\"F\",10^(0.89726074 * LOG(I143/148.026)^2)*T143,\"\")))","v":344.65449351526621},{"$f":"SUM(T143-I143)","v":177.38},null,{"$f":"IF(A143=\"F\",(IF(OR(H143>2001,H143<2004),VLOOKUP(I143,Feuil1!$G$11:$H$25,2))),IF(A143=\"H\",(IF(OR(H143>2001,H143<2004),VLOOKUP(I143,Feuil1!$A$11:$F$29,2)))))","v":"M69"},null,{"$f":"T143-HLOOKUP(X143,#REF!,2,FALSE)","v":{"$error":"#REF!"}},{"$f":"T143-HLOOKUP(X143,#REF!,3,FALSE)","v":{"$error":"#REF!"}},{"$f":"T143-HLOOKUP(X143,#REF!,4,FALSE)","v":{"$error":"#REF!"}},{"$f":"T143-HLOOKUP(X143,#REF!,5,FALSE)","v":{"$error":"#REF!"}},{"$f":"T143-HLOOKUP(X143,#REF!,6,FALSE)","v":{"$error":"#REF!"}},{"$f":"T143-HLOOKUP(X143,#REF!,7,FALSE)","v":{"$error":"#REF!"}},{"$f":"T143-HLOOKUP(X143,#REF!,8,FALSE)","v":{"$error":"#REF!"}},{"$f":"T143-HLOOKUP(X143,#REF!,9,FALSE)","v":{"$error":"#REF!"}},null,null,null,null,null,null,null,{"$f":"IF(AG143>=0,$AG$4,IF(AF143>=0,$AF$4,IF(AE143>=0,$AE$4,IF(AD143>=0,$AD$4,IF(AC143>=0,$AC$4,IF(AB143>=0,$AB$4,IF(AA143>=0,$AA$4,IF(Z143>=0,$Z$4,$AH$4))))))))","v":{"$error":"#REF!"}}]
["H","ZCO","BRE",2,357284,"BEGHAIN","Flavien",2002,68.599999999999994,"AL QUIMPER","F",48,50,52,102,64,65,67,132,234,315.96744976090434,165.4,null,{"$f":"IF(A144=\"F\",(IF(OR(H144>2001,H144<2004),VLOOKUP(I144,Feuil1!$G$11:$H$25,2))),IF(A144=\"H\",(IF(OR(H144>2001,H144<2004),VLOOKUP(I144,Feuil1!$A$11:$F$29,2)))))","v":"M69"},null,{"$f":"T144-HLOOKUP(X144,#REF!,2,FALSE)","v":{"$error":"#REF!"}},{"$f":"T144-HLOOKUP(X144,#REF!,3,FALSE)","v":{"$error":"#REF!"}},{"$f":"T144-HLOOKUP(X144,#REF!,4,FALSE)","v":{"$error":"#REF!"}},{"$f":"T144-HLOOKUP(X144,#REF!,5,FALSE)","v":{"$error":"#REF!"}},{"$f":"T144-HLOOKUP(X144,#REF!,6,FALSE)","v":{"$error":"#REF!"}},{"$f":"T144-HLOOKUP(X144,#REF!,7,FALSE)","v":{"$error":"#REF!"}},{"$f":"T144-HLOOKUP(X144,#REF!,8,FALSE)","v":{"$error":"#REF!"}},{"$f":"T144-HLOOKUP(X144,#REF!,9,FALSE)","v":{"$error":"#REF!"}},null,null,null,null,null,null,null,{"$error":"#REF!"}]
["H","ZCO","BRE",3,360832,"BERTHE","Thibaut",2002,62.3,"AL QUIMPER","F",-41,41,42,83,53,55,57,112,195,281.05003023329317,132.69999999999999,null,{"$f":"IF(A145=\"F\",(IF(OR(H145>2001,H145<2004),VLOOKUP(I145,Feuil1!$G$11:$H$25,2))),IF(A145=\"H\",(IF(OR(H145>2001,H145<2004),VLOOKUP(I145,Feuil1!$A$11:$F$29,2)))))","v":"M69"},null,{"$f":"T145-HLOOKUP(X145,#REF!,2,FALSE)","v":{"$error":"#REF!"}},{"$f":"T145-HLOOKUP(X145,#REF!,3,FALSE)","v":{"$error":"#REF!"}},{"$f":"T145-HLOOKUP(X145,#REF!,4,FALSE)","v":{"$error":"#REF!"}},{"$f":"T145-HLOOKUP(X145,#REF!,5,FALSE)","v":{"$error":"#REF!"}},{"$f":"T145-HLOOKUP(X145,#REF!,6,FALSE)","v":{"$error":"#REF!"}},{"$f":"T145-HLOOKUP(X145,#REF!,7,FALSE)","v":{"$error":"#REF!"}},{"$f":"T145-HLOOKUP(X145,#REF!,8,FALSE)","v":{"$error":"#REF!"}},{"$f":"T145-HLOOKUP(X145,#REF!,9,FALSE)","v":{"$error":"#REF!"}},null,null,null,null,null,null,null,{"$error":"#REF!"}]
["H","ZCO","BRE",4,360255,"BERTHE","Maxence",2003,64.98,"AL QUIMPER","F",-36,36,37,73,47,48,50,98,171,239.34248092459413,106.02,null,{"$f":"IF(A146=\"F\",(IF(OR(H146>2001,H146<2004),VLOOKUP(I146,Feuil1!$G$11:$H$25,2))),IF(A146=\"H\",(IF(OR(H146>2001,H146<2004),VLOOKUP(I146,Feuil1!$A$11:$F$29,2)))))","v":"M69"},null,{"$f":"T146-HLOOKUP(X146,#REF!,2,FALSE)","v":{"$error":"#REF!"}},{"$f":"T146-HLOOKUP(X146,#REF!,3,FALSE)","v":{"$error":"#REF!"}},{"$f":"T146-HLOOKUP(X146,#REF!,4,FALSE)","v":{"$error":"#REF!"}},{"$f":"T146-HLOOKUP(X146,#REF!,5,FALSE)","v":{"$error":"#REF!"}},{"$f":"T146-HLOOKUP(X146,#REF!,6,FALSE)","v":{"$error":"#REF!"}},{"$f":"T146-HLOOKUP(X146,#REF!,7,FALSE)","v":{"$error":"#REF!"}},{"$f":"T146-HLOOKUP(X146,#REF!,8,FALSE)","v":{"$error":"#REF!"}},{"$f":"T146-HLOOKUP(X146,#REF!,9,FALSE)","v":{"$error":"#REF!"}},null,null,null,null,null,null,null,{"$error":"#REF!"}]
["H","NE","BOU",5,339088,"CONNAN","Killyan",2003,68.5,"ASO Mont de Rème","F",34,36,38,74,44,-46,46,90,164,221.65549490861935,95.5,null,{"$f":"IF(A147=\"F\",(IF(OR(H147>2001,H147<2004),VLOOKUP(I147,Feuil1!$G$11:$H$25,2))),IF(A147=\"H\",(IF(OR(H147>2001,H147<2004),VLOOKUP(I147,Feuil1!$A$11:$F$29,2)))))","v":"M69"},null,{"$f":"T147-HLOOKUP(X147,#REF!,2,FALSE)","v":{"$error":"#REF!"}},{"$f":"T147-HLOOKUP(X147,#REF!,3,FALSE)","v":{"$error":"#REF!"}},{"$f":"T147-HLOOKUP(X147,#REF!,4,FALSE)","v":{"$error":"#REF!"}},{"$f":"T147-HLOOKUP(X147,#REF!,5,FALSE)","v":{"$error":"#REF!"}},{"$f":"T147-HLOOKUP(X147,#REF!,6,FALSE)","v":{"$error":"#REF!"}},{"$f":"T147-HLOOKUP(X147,#REF!,7,FALSE)","v":{"$error":"#REF!"}},{"$f":"T147-HLOOKUP(X147,#REF!,8,FALSE)","v":{"$error":"#REF!"}},{"$f":"T147-HLOOKUP(X147,#REF!,9,FALSE)","v":{"$error":"#REF!"}},null,null,null,null,null,null,null,{"$error":"#REF!"}]
["H","SEST","RAL",6,356458,"REYNAUD","Quentin",2002,65.599999999999994,"HF Péageois","F",32,34,-36,66,40,42,44,86,152,211.38374041183567,86.4,null,{"$f":"IF(A148=\"F\",(IF(OR(H148>2001,H148<2004),VLOOKUP(I148,Feuil1!$G$11:$H$25,2))),IF(A148=\"H\",(IF(OR(H148>2001,H148<2004),VLOOKUP(I148,Feuil1!$A$11:$F$29,2)))))","v":"M69"},null,{"$f":"T148-HLOOKUP(X148,#REF!,2,FALSE)","v":{"$error":"#REF!"}},{"$f":"T148-HLOOKUP(X148,#REF!,3,FALSE)","v":{"$error":"#REF!"}},{"$f":"T148-HLOOKUP(X148,#REF!,4,FALSE)","v":{"$error":"#REF!"}},{"$f":"T148-HLOOKUP(X148,#REF!,5,FALSE)","v":{"$error":"#REF!"}},{"$f":"T148-HLOOKUP(X148,#REF!,6,FALSE)","v":{"$error":"#REF!"}},{"$f":"T148-HLOOKUP(X148,#REF!,7,FALSE)","v":{"$error":"#REF!"}},{"$f":"T148-HLOOKUP(X148,#REF!,8,FALSE)","v":{"$error":"#REF!"}},{"$f":"T148-HLOOKUP(X148,#REF!,9,FALSE)","v":{"$error":"#REF!"}},null,null,null,null,null,null,null,{"$error":"#REF!"}]
["H","NORD","PIC",7,376294,"HULOT","Charles",2002,62.46,"Roisel CHFM","F",26,28,30,58,38,40,42,82,140,201.41272590485644,77.539999999999992,null,{"$f":"IF(A149=\"F\",(IF(OR(H149>2001,H149<2004),VLOOKUP(I149,Feuil1!$G$11:$H$25,2))),IF(A149=\"H\",(IF(OR(H149>2001,H149<2004),VLOOKUP(I149,Feuil1!$A$11:$F$29,2)))))","v":"M69"},null,{"$f":"T149-HLOOKUP(X149,#REF!,2,FALSE)","v":{"$error":"#REF!"}},{"$f":"T149-HLOOKUP(X149,#REF!,3,FALSE)","v":{"$error":"#REF!"}},{"$f":"T149-HLOOKUP(X149,#REF!,4,FALSE)","v":{"$error":"#REF!"}},{"$f":"T149-HLOOKUP(X149,#REF!,5,FALSE)","v":{"$error":"#REF!"}},{"$f":"T149-HLOOKUP(X149,#REF!,6,FALSE)","v":{"$error":"#REF!"}},{"$f":"T149-HLOOKUP(X149,#REF!,7,FALSE)","v":{"$error":"#REF!"}},{"$f":"T149-HLOOKUP(X149,#REF!,8,FALSE)","v":{"$error":"#REF!"}},{"$f":"T149-HLOOKUP(X149,#REF!,9,FALSE)","v":{"$error":"#REF!"}},null,null,null,null,null,null,null,{"$error":"#REF!"}]
["H","SEST","CAZ",8,359711,"JAOUEN","Thibault",2002,63.8,"ES VILLENEUVE LOUBET","F",24,26,28,54,36,38,40,78,132,187.09807057084598,68.2,null,{"$f":"IF(A150=\"F\",(IF(OR(H150>2001,H150<2004),VLOOKUP(I150,Feuil1!$G$11:$H$25,2))),IF(A150=\"H\",(IF(OR(H150>2001,H150<2004),VLOOKUP(I150,Feuil1!$A$11:$F$29,2)))))","v":"M69"},null,{"$f":"T150-HLOOKUP(X150,#REF!,2,FALSE)","v":{"$error":"#REF!"}},{"$f":"T150-HLOOKUP(X150,#REF!,3,FALSE)","v":{"$error":"#REF!"}},{"$f":"T150-HLOOKUP(X150,#REF!,4,FALSE)","v":{"$error":"#REF!"}},{"$f":"T150-HLOOKUP(X150,#REF!,5,FALSE)","v":{"$error":"#REF!"}},{"$f":"T150-HLOOKUP(X150,#REF!,6,FALSE)","v":{"$error":"#REF!"}},{"$f":"T150-HLOOKUP(X150,#REF!,7,FALSE)","v":{"$error":"#REF!"}},{"$f":"T150-HLOOKUP(X150,#REF!,8,FALSE)","v":{"$error":"#REF!"}},{"$f":"T150-HLOOKUP(X150,#REF!,9,FALSE)","v":{"$error":"#REF!"}},null,null,null,null,null,null,null,{"$error":"#REF!"}]
["H","NORD","PIC",9,376940,"LEVIONNOIS","Nicolas",2002,63.75,"La Ferté Milon CMHM","F",26,-28,28,54,35,37,39,76,130,184.36354731460639,66.25,null,{"$f":"IF(A151=\"F\",(IF(OR(H151>2001,H151<2004),VLOOKUP(I151,Feuil1!$G$11:$H$25,2))),IF(A151=\"H\",(IF(OR(H151>2001,H151<2004),VLOOKUP(I151,Feuil1!$A$11:$F$29,2)))))","v":"M69"},null,{"$f":"T151-HLOOKUP(X151,#REF!,2,FALSE)","v":{"$error":"#REF!"}},{"$f":"T151-HLOOKUP(X151,#REF!,3,FALSE)","v":{"$error":"#REF!"}},{"$f":"T151-HLOOKUP(X151,#REF!,4,FALSE)","v":{"$error":"#REF!"}},{"$f":"T151-HLOOKUP(X151,#REF!,5,FALSE)","v":{"$error":"#REF!"}},{"$f":"T151-HLOOKUP(X151,#REF!,6,FALSE)","v":{"$error":"#REF!"}},{"$f":"T151-HLOOKUP(X151,#REF!,7,FALSE)","v":{"$error":"#REF!"}},{"$f":"T151-HLOOKUP(X151,#REF!,8,FALSE)","v":{"$error":"#REF!"}},{"$f":"T151-HLOOKUP(X151,#REF!,9,FALSE)","v":{"$error":"#REF!"}},null,null,null,null,null,null,null,{"$error":"#REF!"}]
["H","N","IDF",10,335746,"FAOUZI","BASSAM",2002,66.099999999999994,"CACHAN","F",28,30,-31,58,35,37,-38,72,130,179.86860926328856,63.900000000000006,null,{"$f":"IF(A152=\"F\",(IF(OR(H152>2001,H152<2004),VLOOKUP(I152,Feuil1!$G$11:$H$25,2))),IF(A152=\"H\",(IF(OR(H152>2001,H152<2004),VLOOKUP(I152,Feuil1!$A$11:$F$29,2)))))","v":"M69"},null,{"$f":"T152-HLOOKUP(X152,#REF!,2,FALSE)","v":{"$error":"#REF!"}},{"$f":"T152-HLOOKUP(X152,#REF!,3,FALSE)","v":{"$error":"#REF!"}},{"$f":"T152-HLOOKUP(X152,#REF!,4,FALSE)","v":{"$error":"#REF!"}},{"$f":"T152-HLOOKUP(X152,#REF!,5,FALSE)","v":{"$error":"#REF!"}},{"$f":"T152-HLOOKUP(X152,#REF!,6,FALSE)","v":{"$error":"#REF!"}},{"$f":"T152-HLOOKUP(X152,#REF!,7,FALSE)","v":{"$error":"#REF!"}},{"$f":"T152-HLOOKUP(X152,#REF!,8,FALSE)","v":{"$error":"#REF!"}},{"$f":"T152-HLOOKUP(X152,#REF!,9,FALSE)","v":{"$error":"#REF!"}},null,null,null,null,null,null,null,{"$error":"#REF!"}]
["H","NE","ALS",11,395486,"BUSCH","ETHANN",2002,65.7,"SHC Haguenau","F",26,-28,28,54,35,37,-39,72,126,175.04616845014954,60.3,null,{"$f":"IF(A153=\"F\",(IF(OR(H153>2001,H153<2004),VLOOKUP(I153,Feuil1!$G$11:$H$25,2))),IF(A153=\"H\",(IF(OR(H153>2001,H153<2004),VLOOKUP(I153,Feuil1!$A$11:$F$29,2)))))","v":"M69"},null,{"$f":"T153-HLOOKUP(X153,#REF!,2,FALSE)","v":{"$error":"#REF!"}},{"$f":"T153-HLOOKUP(X153,#REF!,3,FALSE)","v":{"$error":"#REF!"}},{"$f":"T153-HLOOKUP(X153,#REF!,4,FALSE)","v":{"$error":"#REF!"}},{"$f":"T153-HLOOKUP(X153,#REF!,5,FALSE)","v":{"$error":"#REF!"}},{"$f":"T153-HLOOKUP(X153,#REF!,6,FALSE)","v":{"$error":"#REF!"}},{"$f":"T153-HLOOKUP(X153,#REF!,7,FALSE)","v":{"$error":"#REF!"}},{"$f":"T153-HLOOKUP(X153,#REF!,8,FALSE)","v":{"$error":"#REF!"}},{"$f":"T153-HLOOKUP(X153,#REF!,9,FALSE)","v":{"$error":"#REF!"}},null,null,null,null,null,null,null,{"$error":"#REF!"}]
["H","NORD","PIC",12,379759,"MARCHANDISE","Timéo",2002,62.98,"La Vaillante Saint Quentin","F",20,-22,22,42,25,27,29,56,98,140.16653615385334,35.020000000000003,null,{"$f":"IF(A154=\"F\",(IF(OR(H154>2001,H154<2004),VLOOKUP(I154,Feuil1!$G$11:$H$25,2))),IF(A154=\"H\",(IF(OR(H154>2001,H154<2004),VLOOKUP(I154,Feuil1!$A$11:$F$29,2)))))","v":"M69"},null,{"$f":"T154-HLOOKUP(X154,#REF!,2,FALSE)","v":{"$error":"#REF!"}},{"$f":"T154-HLOOKUP(X154,#REF!,3,FALSE)","v":{"$error":"#REF!"}},{"$f":"T154-HLOOKUP(X154,#REF!,4,FALSE)","v":{"$error":"#REF!"}},{"$f":"T154-HLOOKUP(X154,#REF!,5,FALSE)","v":{"$error":"#REF!"}},{"$f":"T154-HLOOKUP(X154,#REF!,6,FALSE)","v":{"$error":"#REF!"}},{"$f":"T154-HLOOKUP(X154,#REF!,7,FALSE)","v":{"$error":"#REF!"}},{"$f":"T154-HLOOKUP(X154,#REF!,8,FALSE)","v":{"$error":"#REF!"}},{"$f":"T154-HLOOKUP(X154,#REF!,9,FALSE)","v":{"$error":"#REF!"}},null,null,null,null,null,null,null,{"$error":"#REF!"}]
["H","N","IDF",13,383960,"KAADOUD","ADAM",2002,68.099999999999994,"CACHAN","F",12,14,16,30,17,19,-20,36,66,89.541353528204283,-2.0999999999999943,null,{"$f":"IF(A155=\"F\",(IF(OR(H155>2001,H155<2004),VLOOKUP(I155,Feuil1!$G$11:$H$25,2))),IF(A155=\"H\",(IF(OR(H155>2001,H155<2004),VLOOKUP(I155,Feuil1!$A$11:$F$29,2)))))","v":"M69"},null,{"$f":"T155-HLOOKUP(X155,#REF!,2,FALSE)","v":{"$error":"#REF!"}},{"$f":"T155-HLOOKUP(X155,#REF!,3,FALSE)","v":{"$error":"#REF!"}},{"$f":"T155-HLOOKUP(X155,#REF!,4,FALSE)","v":{"$error":"#REF!"}},{"$f":"T155-HLOOKUP(X155,#REF!,5,FALSE)","v":{"$error":"#REF!"}},{"$f":"T155-HLOOKUP(X155,#REF!,6,FALSE)","v":{"$error":"#REF!"}},{"$f":"T155-HLOOKUP(X155,#REF!,7,FALSE)","v":{"$error":"#REF!"}},{"$f":"T155-HLOOKUP(X155,#REF!,8,FALSE)","v":{"$error":"#REF!"}},{"$f":"T155-HLOOKUP(X155,#REF!,9,FALSE)","v":{"$error":"#REF!"}},null,null,null,null,null,null,null,{"$error":"#REF!"}]
["H","NE","CHA",14,387906,"ROYER","Joshua",2003,66.400000000000006,"Langres HM","F",7,9,11,20,7,9,11,20,40,55.177077203259913,-26.400000000000006,null,{"$f":"IF(A156=\"F\",(IF(OR(H156>2001,H156<2004),VLOOKUP(I156,Feuil1!$G$11:$H$25,2))),IF(A156=\"H\",(IF(OR(H156>2001,H156<2004),VLOOKUP(I156,Feuil1!$A$11:$F$29,2)))))","v":"M69"},null,{"$f":"T156-HLOOKUP(X156,#REF!,2,FALSE)","v":{"$error":"#REF!"}},{"$f":"T156-HLOOKUP(X156,#REF!,3,FALSE)","v":{"$error":"#REF!"}},{"$f":"T156-HLOOKUP(X156,#REF!,4,FALSE)","v":{"$error":"#REF!"}},{"$f":"T156-HLOOKUP(X156,#REF!,5,FALSE)","v":{"$error":"#REF!"}},{"$f":"T156-HLOOKUP(X156,#REF!,6,FALSE)","v":{"$error":"#REF!"}},{"$f":"T156-HLOOKUP(X156,#REF!,7,FALSE)","v":{"$error":"#REF!"}},{"$f":"T156-HLOOKUP(X156,#REF!,8,FALSE)","v":{"$error":"#REF!"}},{"$f":"T156-HLOOKUP(X156,#REF!,9,FALSE)","v":{"$error":"#REF!"}},null,null,null,null,null,null,null,{"$error":"#REF!"}]
[null,null,null,null,null,null,null,null,null,null,null,null,null,null,null,null,null,null,null,null,null,null,null,null,null,null," ",{"$f":"T157-HLOOKUP(X157,[1]Feuil1!$C$1:$BL$10,2,FALSE)","v":{"$error":"#N/A"}},{"$f":"T157-HLOOKUP(X157,[1]Feuil1!$C$1:$BL$10,3,FALSE)","v":{"$error":"#N/A"}},{"$f":"T157-HLOOKUP(X157,[1]Feuil1!$C$1:$BL$10,4,FALSE)","v":{"$error":"#N/A"}},{"$f":"T157-HLOOKUP(X157,[1]Feuil1!$C$1:$BL$10,5,FALSE)","v":{"$error":"#N/A"}},{"$f":"T157-HLOOKUP(X157,[1]Feuil1!$C$1:$BL$10,6,FALSE)","v":{"$error":"#N/A"}},{"$f":"T157-HLOOKUP(X157,[1]Feuil1!$C$1:$BL$10,7,FALSE)","v":{"$error":"#N/A"}},{"$f":"T157-HLOOKUP(X157,[1]Feuil1!$C$1:$BL$10,8,FALSE)","v":{"$error":"#N/A"}},{"$f":"T157-HLOOKUP(X157,[1]Feuil1!$C$1:$BL$10,9,FALSE)","v":{"$error":"#N/A"}},{"$f":"T157-HLOOKUP(X157,[1]Feuil1!$C$1:$BL$10,10,FALSE)","v":{"$error":"#N/A"}},null,null,null,null,null,null,{"$f":"IF(AJ157>=0,$AJ$4,IF(AI157>=0,$AI$4,IF(AH157>=0,$AH$4,IF(AG157>=0,$AG$4,IF(AF157>=0,$AF$4,IF(AE157>=0,$AE$4,IF(AD157>=0,$AD$4,IF(AC157>=0,$AC$4,$AB$4))))))))","v":{"$error":"#N/A"}}]
["H","ZCO","BRE",1,357284,"BEGHAIN","Flavien",2002,69.510000000000005,"AL QUIMPER","F",49,51,53,{"$f":"IF(MAXA(L158+M158,M158+N158,L158+N158,L158,M158,N158)<=0,0,MAXA(L158+M158,M158+N158,L158+N158,L158,M158,N158))","v":104},65,66,68,{"$f":"IF(MAXA(P158+Q158,Q158+R158,P158+R158,P158,Q158,R158)<=0,0,MAXA(P158+Q158,Q158+R158,P158+R158,P158,Q158,R158))","v":134},{"$f":"IF(H158=\"\",\"\",IF(OR(O158=0,S158=0),0,O158+S158))","v":238},{"$f":"IF(I158=\"\",\"\",IF(A158=\"H\",10^(0.794358141*LOG(I158/174.393)^2)*T158,IF(A158=\"F\",10^(0.89726074 * LOG(I158/148.026)^2)*T158,\"\")))","v":318.6729043931179},{"$f":"SUM(T158-I158)","v":168.49},null,{"$f":"IF(A158=\"F\",(IF(OR(H158>2001,H158<2004),VLOOKUP(I158,Feuil1!$G$11:$H$25,2))),IF(A158=\"H\",(IF(OR(H158>2001,H158<2004),VLOOKUP(I158,Feuil1!$A$11:$F$29,2)))))","v":"M77"},null,{"$f":"T158-HLOOKUP(X158,#REF!,2,FALSE)","v":{"$error":"#REF!"}},{"$f":"T158-HLOOKUP(X158,#REF!,3,FALSE)","v":{"$error":"#REF!"}},{"$f":"T158-HLOOKUP(X158,#REF!,4,FALSE)","v":{"$error":"#REF!"}},{"$f":"T158-HLOOKUP(X158,#REF!,5,FALSE)","v":{"$error":"#REF!"}},{"$f":"T158-HLOOKUP(X158,#REF!,6,FALSE)","v":{"$error":"#REF!"}},{"$f":"T158-HLOOKUP(X158,#REF!,7,FALSE)","v":{"$error":"#REF!"}},{"$f":"T158-HLOOKUP(X158,#REF!,8,FALSE)","v":{"$error":"#REF!"}},{"$f":"T158-HLOOKUP(X158,#REF!,9,FALSE)","v":{"$error":"#REF!"}},null,null,null,null,null,null,null,{"$f":"IF(AG158>=0,$AG$4,IF(AF158>=0,$AF$4,IF(AE158>=0,$AE$4,IF(AD158>=0,$AD$4,IF(AC158>=0,$AC$4,IF(AB158>=0,$AB$4,IF(AA158>=0,$AA$4,IF(Z158>=0,$Z$4,$AH$4))))))))","v":{"$error":"#REF!"}}]
["H","SEST","PRO",2,374428,"BOGUCKI","Vincent",2002,69.37,"ISTRES SPORTS","F",-39,39,40,{"$f":"IF(MAXA(L159+M159,M159+N159,L159+N159,L159,M159,N159)<=0,0,MAXA(L159+M159,M159+N159,L159+N159,L159,M159,N159))","v":79},44,46,-48,{"$f":"IF(MAXA(P159+Q159,Q159+R159,P159+R159,P159,Q159,R159)<=0,0,MAXA(P159+Q159,Q159+R159,P159+R159,P159,Q159,R159))","v":90},{"$f":"IF(H159=\"\",\"\",IF(OR(O159=0,S159=0),0,O159+S159))","v":169},{"$f":"IF(I159=\"\",\"\",IF(A159=\"H\",10^(0.794358141*LOG(I159/174.393)^2)*T159,IF(A159=\"F\",10^(0.89726074 * LOG(I159/148.026)^2)*T159,\"\")))","v":226.57458979470431},{"$f":"SUM(T159-I159)","v":99.63},null,{"$f":"IF(A159=\"F\",(IF(OR(H159>2001,H159<2004),VLOOKUP(I159,Feuil1!$G$11:$H$25,2))),IF(A159=\"H\",(IF(OR(H159>2001,H159<2004),VLOOKUP(I159,Feuil1!$A$11:$F$29,2)))))","v":"M77"},null,{"$f":"T159-HLOOKUP(X159,#REF!,2,FALSE)","v":{"$error":"#REF!"}},{"$f":"T159-HLOOKUP(X159,#REF!,3,FALSE)","v":{"$error":"#REF!"}},{"$f":"T159-HLOOKUP(X159,#REF!,4,FALSE)","v":{"$error":"#REF!"}},{"$f":"T159-HLOOKUP(X159,#REF!,5,FALSE)","v":{"$error":"#REF!"}},{"$f":"T159-HLOOKUP(X159,#REF!,6,FALSE)","v":{"$error":"#REF!"}},{"$f":"T159-HLOOKUP(X159,#REF!,7,FALSE)","v":{"$error":"#REF!"}},{"$f":"T159-HLOOKUP(X159,#REF!,8,FALSE)","v":{"$error":"#REF!"}},{"$f":"T159-HLOOKUP(X159,#REF!,9,FALSE)","v":{"$error":"#REF!"}},null,null,null,null,null,null,null,{"$f":"IF(AG159>=0,$AG$4,IF(AF159>=0,$AF$4,IF(AE159>=0,$AE$4,IF(AD159>=0,$AD$4,IF(AC159>=0,$AC$4,IF(AB159>=0,$AB$4,IF(AA159>=0,$AA$4,IF(Z159>=0,$Z$4,$AH$4))))))))","v":{"$error":"#REF!"}}]
["H","NE","BOU",3,339088,"CONNAN","Killyan",2003,69.2,"ASO Mont de Rème","F",36,37,38,{"$f":"IF(MAXA(L160+M160,M160+N160,L160+N160,L160,M160,N160)<=0,0,MAXA(L160+M160,M160+N160,L160+N160,L160,M160,N160))","v":75},-46,46,47,{"$f":"IF(MAXA(P160+Q160,Q160+R160,P160+R160,P160,Q160,R160)<=0,0,MAXA(P160+Q160,Q160+R160,P160+R160,P160,Q160,R160))","v":93},{"$f":"IF(H160=\"\",\"\",IF(OR(O160=0,S160=0),0,O160+S160))","v":168},{"$f":"IF(I160=\"\",\"\",IF(A160=\"H\",10^(0.794358141*LOG(I160/174.393)^2)*T160,IF(A160=\"F\",10^(0.89726074 * LOG(I160/148.026)^2)*T160,\"\")))","v":225.58616484469775},{"$f":"SUM(T160-I160)","v":98.8},null,{"$f":"IF(A160=\"F\",(IF(OR(H160>2001,H160<2004),VLOOKUP(I160,Feuil1!$G$11:$H$25,2))),IF(A160=\"H\",(IF(OR(H160>2001,H160<2004),VLOOKUP(I160,Feuil1!$A$11:$F$29,2)))))","v":"M77"},null,{"$f":"T160-HLOOKUP(X160,#REF!,2,FALSE)","v":{"$error":"#REF!"}},{"$f":"T160-HLOOKUP(X160,#REF!,3,FALSE)","v":{"$error":"#REF!"}},{"$f":"T160-HLOOKUP(X160,#REF!,4,FALSE)","v":{"$error":"#REF!"}},{"$f":"T160-HLOOKUP(X160,#REF!,5,FALSE)","v":{"$error":"#REF!"}},{"$f":"T160-HLOOKUP(X160,#REF!,6,FALSE)","v":{"$error":"#REF!"}},{"$f":"T160-HLOOKUP(X160,#REF!,7,FALSE)","v":{"$error":"#REF!"}},{"$f":"T160-HLOOKUP(X160,#REF!,8,FALSE)","v":{"$error":"#REF!"}},{"$f":"T160-HLOOKUP(X160,#REF!,9,FALSE)","v":{"$error":"#REF!"}},null,null,null,null,null,null,null,{"$f":"IF(AG160>=0,$AG$4,IF(AF160>=0,$AF$4,IF(AE160>=0,$AE$4,IF(AD160>=0,$AD$4,IF(AC160>=0,$AC$4,IF(AB160>=0,$AB$4,IF(AA160>=0,$AA$4,IF(Z160>=0,$Z$4,$AH$4))))))))","v":{"$error":"#REF!"}}]
["H","NORD","NPC",4,375845,"MAQUAIRE-MILLE","Gordon",2003,73.2,"CHCD COMINES","F",15,17,19,{"$f":"IF(MAXA(L161+M161,M161+N161,L161+N161,L161,M161,N161)<=0,0,MAXA(L161+M161,M161+N161,L161+N161,L161,M161,N161))","v":36},30,32,-34,{"$f":"IF(MAXA(P161+Q161,Q161+R161,P161+R161,P161,Q161,R161)<=0,0,MAXA(P161+Q161,Q161+R161,P161+R161,P161,Q161,R161))","v":62},{"$f":"IF(H161=\"\",\"\",IF(OR(O161=0,S161=0),0,O161+S161))","v":98},{"$f":"IF(I161=\"\",\"\",IF(A161=\"H\",10^(0.794358141*LOG(I161/174.393)^2)*T161,IF(A161=\"F\",10^(0.89726074 * LOG(I161/148.026)^2)*T161,\"\")))","v":127.09783881276421},{"$f":"SUM(T161-I161)","v":24.799999999999997},null,{"$f":"IF(A161=\"F\",(IF(OR(H161>2001,H161<2004),VLOOKUP(I161,Feuil1!$G$11:$H$25,2))),IF(A161=\"H\",(IF(OR(H161>2001,H161<2004),VLOOKUP(I161,Feuil1!$A$11:$F$29,2)))))","v":"M77"},null,{"$f":"T161-HLOOKUP(X161,#REF!,2,FALSE)","v":{"$error":"#REF!"}},{"$f":"T161-HLOOKUP(X161,#REF!,3,FALSE)","v":{"$error":"#REF!"}},{"$f":"T161-HLOOKUP(X161,#REF!,4,FALSE)","v":{"$error":"#REF!"}},{"$f":"T161-HLOOKUP(X161,#REF!,5,FALSE)","v":{"$error":"#REF!"}},{"$f":"T161-HLOOKUP(X161,#REF!,6,FALSE)","v":{"$error":"#REF!"}},{"$f":"T161-HLOOKUP(X161,#REF!,7,FALSE)","v":{"$error":"#REF!"}},{"$f":"T161-HLOOKUP(X161,#REF!,8,FALSE)","v":{"$error":"#REF!"}},{"$f":"T161-HLOOKUP(X161,#REF!,9,FALSE)","v":{"$error":"#REF!"}},null,null,null,null,null,null,null,{"$f":"IF(AG161>=0,$AG$4,IF(AF161>=0,$AF$4,IF(AE161>=0,$AE$4,IF(AD161>=0,$AD$4,IF(AC161>=0,$AC$4,IF(AB161>=0,$AB$4,IF(AA161>=0,$AA$4,IF(Z161>=0,$Z$4,$AH$4))))))))","v":{"$error":"#REF!"}}]
["H","N","IDF",5,383960,"KAADOUD","ADAM",2002,71.599999999999994,"CACHAN","F",17,19,20,{"$f":"IF(MAXA(L162+M162,M162+N162,L162+N162,L162,M162,N162)<=0,0,MAXA(L162+M162,M162+N162,L162+N162,L162,M162,N162))","v":39},20,22,24,{"$f":"IF(MAXA(P162+Q162,Q162+R162,P162+R162,P162,Q162,R162)<=0,0,MAXA(P162+Q162,Q162+R162,P162+R162,P162,Q162,R162))","v":46},{"$f":"IF(H162=\"\",\"\",IF(OR(O162=0,S162=0),0,O162+S162))","v":85},{"$f":"IF(I162=\"\",\"\",IF(A162=\"H\",10^(0.794358141*LOG(I162/174.393)^2)*T162,IF(A162=\"F\",10^(0.89726074 * LOG(I162/148.026)^2)*T162,\"\")))","v":111.72572654487331},{"$f":"SUM(T162-I162)","v":13.400000000000006},null,{"$f":"IF(A162=\"F\",(IF(OR(H162>2001,H162<2004),VLOOKUP(I162,Feuil1!$G$11:$H$25,2))),IF(A162=\"H\",(IF(OR(H162>2001,H162<2004),VLOOKUP(I162,Feuil1!$A$11:$F$29,2)))))","v":"M77"},null,{"$f":"T162-HLOOKUP(X162,#REF!,2,FALSE)","v":{"$error":"#REF!"}},{"$f":"T162-HLOOKUP(X162,#REF!,3,FALSE)","v":{"$error":"#REF!"}},{"$f":"T162-HLOOKUP(X162,#REF!,4,FALSE)","v":{"$error":"#REF!"}},{"$f":"T162-HLOOKUP(X162,#REF!,5,FALSE)","v":{"$error":"#REF!"}},{"$f":"T162-HLOOKUP(X162,#REF!,6,FALSE)","v":{"$error":"#REF!"}},{"$f":"T162-HLOOKUP(X162,#REF!,7,FALSE)","v":{"$error":"#REF!"}},{"$f":"T162-HLOOKUP(X162,#REF!,8,FALSE)","v":{"$error":"#REF!"}},{"$f":"T162-HLOOKUP(X162,#REF!,9,FALSE)","v":{"$error":"#REF!"}},null,null,null,null,null,null,null,{"$f":"IF(AG162>=0,$AG$4,IF(AF162>=0,$AF$4,IF(AE162>=0,$AE$4,IF(AD162>=0,$AD$4,IF(AC162>=0,$AC$4,IF(AB162>=0,$AB$4,IF(AA162>=0,$AA$4,IF(Z162>=0,$Z$4,$AH$4))))))))","v":{"$error":"#REF!"}}]
[null,null,null,null,null,null,null,null,null,null,null,null,null,null,null,null,null,null,null,null,null,null,null,null,null,null," ",{"$f":"T163-HLOOKUP(X163,[1]Feuil1!$C$1:$BL$10,2,FALSE)","v":{"$error":"#N/A"}},{"$f":"T163-HLOOKUP(X163,[1]Feuil1!$C$1:$BL$10,3,FALSE)","v":{"$error":"#N/A"}},{"$f":"T163-HLOOKUP(X163,[1]Feuil1!$C$1:$BL$10,4,FALSE)","v":{"$error":"#N/A"}},{"$f":"T163-HLOOKUP(X163,[1]Feuil1!$C$1:$BL$10,5,FALSE)","v":{"$error":"#N/A"}},{"$f":"T163-HLOOKUP(X163,[1]Feuil1!$C$1:$BL$10,6,FALSE)","v":{"$error":"#N/A"}},{"$f":"T163-HLOOKUP(X163,[1]Feuil1!$C$1:$BL$10,7,FALSE)","v":{"$error":"#N/A"}},{"$f":"T163-HLOOKUP(X163,[1]Feuil1!$C$1:$BL$10,8,FALSE)","v":{"$error":"#N/A"}},{"$f":"T163-HLOOKUP(X163,[1]Feuil1!$C$1:$BL$10,9,FALSE)","v":{"$error":"#N/A"}},{"$f":"T163-HLOOKUP(X163,[1]Feuil1!$C$1:$BL$10,10,FALSE)","v":{"$error":"#N/A"}},null,null,null,null,null,null,{"$f":"IF(AJ163>=0,$AJ$4,IF(AI163>=0,$AI$4,IF(AH163>=0,$AH$4,IF(AG163>=0,$AG$4,IF(AF163>=0,$AF$4,IF(AE163>=0,$AE$4,IF(AD163>=0,$AD$4,IF(AC163>=0,$AC$4,$AB$4))))))))","v":{"$error":"#N/A"}}]
["H","NE","ALS",1,375934,"BARD","AXEL",2002,84.9,"SHC Haguenau","F",33,35,37,{"$f":"IF(MAXA(L164+M164,M164+N164,L164+N164,L164,M164,N164)<=0,0,MAXA(L164+M164,M164+N164,L164+N164,L164,M164,N164))","v":72},42,44,46,{"$f":"IF(MAXA(P164+Q164,Q164+R164,P164+R164,P164,Q164,R164)<=0,0,MAXA(P164+Q164,Q164+R164,P164+R164,P164,Q164,R164))","v":90},{"$f":"IF(H164=\"\",\"\",IF(OR(O164=0,S164=0),0,O164+S164))","v":162},{"$f":"IF(I164=\"\",\"\",IF(A164=\"H\",10^(0.794358141*LOG(I164/174.393)^2)*T164,IF(A164=\"F\",10^(0.89726074 * LOG(I164/148.026)^2)*T164,\"\")))","v":193.70878394758864},{"$f":"SUM(T164-I164)","v":77.099999999999994},null,{"$f":"IF(A164=\"F\",(IF(OR(H164>2001,H164<2004),VLOOKUP(I164,Feuil1!$G$11:$H$25,2))),IF(A164=\"H\",(IF(OR(H164>2001,H164<2004),VLOOKUP(I164,Feuil1!$A$11:$F$29,2)))))","v":"M+77"},null,{"$f":"T164-HLOOKUP(X164,#REF!,2,FALSE)","v":{"$error":"#REF!"}},{"$f":"T164-HLOOKUP(X164,#REF!,3,FALSE)","v":{"$error":"#REF!"}},{"$f":"T164-HLOOKUP(X164,#REF!,4,FALSE)","v":{"$error":"#REF!"}},{"$f":"T164-HLOOKUP(X164,#REF!,5,FALSE)","v":{"$error":"#REF!"}},{"$f":"T164-HLOOKUP(X164,#REF!,6,FALSE)","v":{"$error":"#REF!"}},{"$f":"T164-HLOOKUP(X164,#REF!,7,FALSE)","v":{"$error":"#REF!"}},{"$f":"T164-HLOOKUP(X164,#REF!,8,FALSE)","v":{"$error":"#REF!"}},{"$f":"T164-HLOOKUP(X164,#REF!,9,FALSE)","v":{"$error":"#REF!"}},null,null,null,null,null,null,null,{"$f":"IF(AG164>=0,$AG$4,IF(AF164>=0,$AF$4,IF(AE164>=0,$AE$4,IF(AD164>=0,$AD$4,IF(AC164>=0,$AC$4,IF(AB164>=0,$AB$4,IF(AA164>=0,$AA$4,IF(Z164>=0,$Z$4,$AH$4))))))))","v":{"$error":"#REF!"}}]
["H","NORD","NPC",2,385701,"BAILLEUL","Maxime",2002,82.74,"ST POL/MER","F",31,33,35,{"$f":"IF(MAXA(L165+M165,M165+N165,L165+N165,L165,M165,N165)<=0,0,MAXA(L165+M165,M165+N165,L165+N165,L165,M165,N165))","v":68},44,46,47,{"$f":"IF(MAXA(P165+Q165,Q165+R165,P165+R165,P165,Q165,R165)<=0,0,MAXA(P165+Q165,Q165+R165,P165+R165,P165,Q165,R165))","v":93},{"$f":"IF(H165=\"\",\"\",IF(OR(O165=0,S165=0),0,O165+S165))","v":161},{"$f":"IF(I165=\"\",\"\",IF(A165=\"H\",10^(0.794358141*LOG(I165/174.393)^2)*T165,IF(A165=\"F\",10^(0.89726074 * LOG(I165/148.026)^2)*T165,\"\")))","v":195.03765230195717},{"$f":"SUM(T165-I165)","v":78.260000000000005},null,{"$f":"IF(A165=\"F\",(IF(OR(H165>2001,H165<2004),VLOOKUP(I165,Feuil1!$G$11:$H$25,2))),IF(A165=\"H\",(IF(OR(H165>2001,H165<2004),VLOOKUP(I165,Feuil1!$A$11:$F$29,2)))))","v":"M+77"},null,{"$f":"T165-HLOOKUP(X165,#REF!,2,FALSE)","v":{"$error":"#REF!"}},{"$f":"T165-HLOOKUP(X165,#REF!,3,FALSE)","v":{"$error":"#REF!"}},{"$f":"T165-HLOOKUP(X165,#REF!,4,FALSE)","v":{"$error":"#REF!"}},{"$f":"T165-HLOOKUP(X165,#REF!,5,FALSE)","v":{"$error":"#REF!"}},{"$f":"T165-HLOOKUP(X165,#REF!,6,FALSE)","v":{"$error":"#REF!"}},{"$f":"T165-HLOOKUP(X165,#REF!,7,FALSE)","v":{"$error":"#REF!"}},{"$f":"T165-HLOOKUP(X165,#REF!,8,FALSE)","v":{"$error":"#REF!"}},{"$f":"T165-HLOOKUP(X165,#REF!,9,FALSE)","v":{"$error":"#REF!"}},null,null,null,null,null,null,null,{"$f":"IF(AG165>=0,$AG$4,IF(AF165>=0,$AF$4,IF(AE165>=0,$AE$4,IF(AD165>=0,$AD$4,IF(AC165>=0,$AC$4,IF(AB165>=0,$AB$4,IF(AA165>=0,$AA$4,IF(Z165>=0,$Z$4,$AH$4))))))))","v":{"$error":"#REF!"}}]
["H","ZCO","BRE",3,380277,"COATMEN","Maxime",2002,85.44,"AL QUIMPER","F",32,34,-36,{"$f":"IF(MAXA(L166+M166,M166+N166,L166+N166,L166,M166,N166)<=0,0,MAXA(L166+M166,M166+N166,L166+N166,L166,M166,N166))","v":66},43,45,-47,{"$f":"IF(MAXA(P166+Q166,Q166+R166,P166+R166,P166,Q166,R166)<=0,0,MAXA(P166+Q166,Q166+R166,P166+R166,P166,Q166,R166))","v":88},{"$f":"IF(H166=\"\",\"\",IF(OR(O166=0,S166=0),0,O166+S166))","v":154},{"$f":"IF(I166=\"\",\"\",IF(A166=\"H\",10^(0.794358141*LOG(I166/174.393)^2)*T166,IF(A166=\"F\",10^(0.89726074 * LOG(I166/148.026)^2)*T166,\"\")))","v":183.56650857526324},{"$f":"SUM(T166-I166)","v":68.56},null,{"$f":"IF(A166=\"F\",(IF(OR(H166>2001,H166<2004),VLOOKUP(I166,Feuil1!$G$11:$H$25,2))),IF(A166=\"H\",(IF(OR(H166>2001,H166<2004),VLOOKUP(I166,Feuil1!$A$11:$F$29,2)))))","v":"M+77"},null,{"$f":"T166-HLOOKUP(X166,#REF!,2,FALSE)","v":{"$error":"#REF!"}},{"$f":"T166-HLOOKUP(X166,#REF!,3,FALSE)","v":{"$error":"#REF!"}},{"$f":"T166-HLOOKUP(X166,#REF!,4,FALSE)","v":{"$error":"#REF!"}},{"$f":"T166-HLOOKUP(X166,#REF!,5,FALSE)","v":{"$error":"#REF!"}},{"$f":"T166-HLOOKUP(X166,#REF!,6,FALSE)","v":{"$error":"#REF!"}},{"$f":"T166-HLOOKUP(X166,#REF!,7,FALSE)","v":{"$error":"#REF!"}},{"$f":"T166-HLOOKUP(X166,#REF!,8,FALSE)","v":{"$error":"#REF!"}},{"$f":"T166-HLOOKUP(X166,#REF!,9,FALSE)","v":{"$error":"#REF!"}},null,null,null,null,null,null,null,{"$f":"IF(AG166>=0,$AG$4,IF(AF166>=0,$AF$4,IF(AE166>=0,$AE$4,IF(AD166>=0,$AD$4,IF(AC166>=0,$AC$4,IF(AB166>=0,$AB$4,IF(AA166>=0,$AA$4,IF(Z166>=0,$Z$4,$AH$4))))))))","v":{"$error":"#REF!"}}]
["H","ZCO","CEN",4,327171,"BENBOUCHTA","Nassim",2002,93.8,"AAJ BLOIS","F",30,32,34,{"$f":"IF(MAXA(L167+M167,M167+N167,L167+N167,L167,M167,N167)<=0,0,MAXA(L167+M167,M167+N167,L167+N167,L167,M167,N167))","v":66},40,42,44,{"$f":"IF(MAXA(P167+Q167,Q167+R167,P167+R167,P167,Q167,R167)<=0,0,MAXA(P167+Q167,Q167+R167,P167+R167,P167,Q167,R167))","v":86},{"$f":"IF(H167=\"\",\"\",IF(OR(O167=0,S167=0),0,O167+S167))","v":152},{"$f":"IF(I167=\"\",\"\",IF(A167=\"H\",10^(0.794358141*LOG(I167/174.393)^2)*T167,IF(A167=\"F\",10^(0.89726074 * LOG(I167/148.026)^2)*T167,\"\")))","v":173.56559149819941},{"$f":"SUM(T167-I167)","v":58.2},null,{"$f":"IF(A167=\"F\",(IF(OR(H167>2001,H167<2004),VLOOKUP(I167,Feuil1!$G$11:$H$25,2))),IF(A167=\"H\",(IF(OR(H167>2001,H167<2004),VLOOKUP(I167,Feuil1!$A$11:$F$29,2)))))","v":"M+77"},null,{"$f":"T167-HLOOKUP(X167,#REF!,2,FALSE)","v":{"$error":"#REF!"}},{"$f":"T167-HLOOKUP(X167,#REF!,3,FALSE)","v":{"$error":"#REF!"}},{"$f":"T167-HLOOKUP(X167,#REF!,4,FALSE)","v":{"$error":"#REF!"}},{"$f":"T167-HLOOKUP(X167,#REF!,5,FALSE)","v":{"$error":"#REF!"}},{"$f":"T167-HLOOKUP(X167,#REF!,6,FALSE)","v":{"$error":"#REF!"}},{"$f":"T167-HLOOKUP(X167,#REF!,7,FALSE)","v":{"$error":"#REF!"}},{"$f":"T167-HLOOKUP(X167,#REF!,8,FALSE)","v":{"$error":"#REF!"}},{"$f":"T167-HLOOKUP(X167,#REF!,9,FALSE)","v":{"$error":"#REF!"}},null,null,null,null,null,null,null,{"$f":"IF(AG167>=0,$AG$4,IF(AF167>=0,$AF$4,IF(AE167>=0,$AE$4,IF(AD167>=0,$AD$4,IF(AC167>=0,$AC$4,IF(AB167>=0,$AB$4,IF(AA167>=0,$AA$4,IF(Z167>=0,$Z$4,$AH$4))))))))","v":{"$error":"#REF!"}}]
["H","NE","ALS",5,327057,"LAEMLIN","JULES",2003,80.599999999999994,"US Wittenheim","F",27,29,31,{"$f":"IF(MAXA(L168+M168,M168+N168,L168+N168,L168,M168,N168)<=0,0,MAXA(L168+M168,M168+N168,L168+N168,L168,M168,N168))","v":60},31,33,35,{"$f":"IF(MAXA(P168+Q168,Q168+R168,P168+R168,P168,Q168,R168)<=0,0,MAXA(P168+Q168,Q168+R168,P168+R168,P168,Q168,R168))","v":68},{"$f":"IF(H168=\"\",\"\",IF(OR(O168=0,S168=0),0,O168+S168))","v":128},{"$f":"IF(I168=\"\",\"\",IF(A168=\"H\",10^(0.794358141*LOG(I168/174.393)^2)*T168,IF(A168=\"F\",10^(0.89726074 * LOG(I168/148.026)^2)*T168,\"\")))","v":157.20273452002519},{"$f":"SUM(T168-I168)","v":47.400000000000006},null,{"$f":"IF(A168=\"F\",(IF(OR(H168>2001,H168<2004),VLOOKUP(I168,Feuil1!$G$11:$H$25,2))),IF(A168=\"H\",(IF(OR(H168>2001,H168<2004),VLOOKUP(I168,Feuil1!$A$11:$F$29,2)))))","v":"M+77"},null,{"$f":"T168-HLOOKUP(X168,#REF!,2,FALSE)","v":{"$error":"#REF!"}},{"$f":"T168-HLOOKUP(X168,#REF!,3,FALSE)","v":{"$error":"#REF!"}},{"$f":"T168-HLOOKUP(X168,#REF!,4,FALSE)","v":{"$error":"#REF!"}},{"$f":"T168-HLOOKUP(X168,#REF!,5,FALSE)","v":{"$error":"#REF!"}},{"$f":"T168-HLOOKUP(X168,#REF!,6,FALSE)","v":{"$error":"#REF!"}},{"$f":"T168-HLOOKUP(X168,#REF!,7,FALSE)","v":{"$error":"#REF!"}},{"$f":"T168-HLOOKUP(X168,#REF!,8,FALSE)","v":{"$error":"#REF!"}},{"$f":"T168-HLOOKUP(X168,#REF!,9,FALSE)","v":{"$error":"#REF!"}},null,null,null,null,null,null,null,{"$f":"IF(AG168>=0,$AG$4,IF(AF168>=0,$AF$4,IF(AE168>=0,$AE$4,IF(AD168>=0,$AD$4,IF(AC168>=0,$AC$4,IF(AB168>=0,$AB$4,IF(AA168>=0,$AA$4,IF(Z168>=0,$Z$4,$AH$4))))))))","v":{"$error":"#REF!"}}]
[null,null,null,null,null,null,null,null,null,null,null,null,null,null,null,null,null,null,null,null,null,null,null,null,null,null," ",{"$f":"T169-HLOOKUP(X169,[1]Feuil1!$C$1:$BL$10,2,FALSE)","v":{"$error":"#N/A"}},{"$f":"T169-HLOOKUP(X169,[1]Feuil1!$C$1:$BL$10,3,FALSE)","v":{"$error":"#N/A"}},{"$f":"T169-HLOOKUP(X169,[1]Feuil1!$C$1:$BL$10,4,FALSE)","v":{"$error":"#N/A"}},{"$f":"T169-HLOOKUP(X169,[1]Feuil1!$C$1:$BL$10,5,FALSE)","v":{"$error":"#N/A"}},{"$f":"T169-HLOOKUP(X169,[1]Feuil1!$C$1:$BL$10,6,FALSE)","v":{"$error":"#N/A"}},{"$f":"T169-HLOOKUP(X169,[1]Feuil1!$C$1:$BL$10,7,FALSE)","v":{"$error":"#N/A"}},{"$f":"T169-HLOOKUP(X169,[1]Feuil1!$C$1:$BL$10,8,FALSE)","v":{"$error":"#N/A"}},{"$f":"T169-HLOOKUP(X169,[1]Feuil1!$C$1:$BL$10,9,FALSE)","v":{"$error":"#N/A"}},{"$f":"T169-HLOOKUP(X169,[1]Feuil1!$C$1:$BL$10,10,FALSE)","v":{"$error":"#N/A"}},null,null,null,null,null,null,{"$f":"IF(AJ169>=0,$AJ$4,IF(AI169>=0,$AI$4,IF(AH169>=0,$AH$4,IF(AG169>=0,$AG$4,IF(AF169>=0,$AF$4,IF(AE169>=0,$AE$4,IF(AD169>=0,$AD$4,IF(AC169>=0,$AC$4,$AB$4))))))))","v":{"$error":"#N/A"}}]
[]
[]
[]
[]
[]
[]
[]
[]
[]
[]
[]
[]
[]
[]
[]
[]
[]
[]
[]
[]
[]
[]
[]
[]
[]
[]
[]
[]
[]
[]
[]
[]
[]
[]
[]
[]
[]
[]
[]
[]
[]
[]
[]
[]
[]
[]
[]
[]
[]
[]
[]
[]
[]
[]
[]
[]
[]
[]
[]
[]
[]
[]
[]
[]
[]
[]
[]
[]
[]
[]
[]
[]
[]
[]
[]
[]
[]
[]
[]
[]
[]
[]
[]
[]
[]
[]
[]
[]
[]
[]
[]
[]
[]
[]
[]
[]
[]
[]
[]
[]
[]
[]
[]
[]
[]
[]
[]
[]
[]
[]
[]
[]
[]
[]
[]
[]
[]
[]
[]
[]
[]
[]
[]
[]
[]
[]
[]
[]
[]
[]
[]
[]
[]
[]
[]
[]
[]
[]
[]
[]
[]
[]
[]
[]
[]
[]
[]
[]
[]
[]
[]
[]
[]
[]
[]
[]
[]
[]
[]
[]
[]
[]
[]
[]
[]
[]
[]
[]
[]
[]
[]
[]
[]
[]
[]
[]
[]
[]
[]
[]
[]
[]
[]
[]
[]
[]
[]
[]
[]
[]
[]
[]
[]
[]
[]
[]
[]
[]
[]
[]
[]
[]
[]
[]
[]
[]
[]
[]
[]
[]
[]
[]
[]
[]
[]
[]
[]
[]
[]
[]
[]
[]
[]
[]
[]
[]
[]
[]
[]
[]
[]
[]
[]
[]
[]
[]
[]
[]
[]
[]
[]
[]
[]
[]
[]
[]
[]
[]
[]
[]
[]
[]
[]
[]
[]
[]
[]
[]
[]
[]
[]
[]
[]
[]
[]
[]
[]
[]
[]
[]
[]
[]
[]
[]
[]
[]
[]
[]
[]
[]
[]
[]
[]
[]
[]
[]
[]
[]
[]
[]
[]
[]
[]
[]
[]
[]
[]
[]
[]
[]
[]
[]
[]
[]
[]
[]
[]
[]
[]
[]
[]
[]
[]
[]
[]
[]
[]
[]
[]
[]
[]
[]
[]
[]
[]
[]
[]
[]
[]
[]
[]
[]
[]
[]
[]
[]
[]
[]
[]
[]
[]
[]
[]
[]
[]
[]
[]
[]
[]
[]
[]
[]
[]
[]
[]
[]
[]
[]
[]
[]
[]
[]
[]
[]
[]
[]
[]
[]
[]
[]
[]
[]
[]
[]
[]
[]
[]
[]
[]
[]
[]
[]
[]
[]
[]
[]
[]
[]
[]
[]
[]
[]
[]
[]
[]
[]
[]
[]
[]
[]
[]
[]
[]
[]
[]
[]
[]
[]
[]
[]
[]
[]
[]
[]
[]
[]
[]
[]
[]
[]
[]
[]
[]
[]
[]
[]
[]
[]
[]
[]
[]
[]
[]
[]
[]
[]
[]
[]
[]
[]
[]
[]
[]
[]
[]
[]
[]
[]
[]
[]
[]
[]
[]
[]
[]
[]
[]
[]
[]
[]
[]
[]
[]
[]
[]
[]
[]
[]
[]
[]
[]
[]
[]
[]
[]
[]
[]
[]
[]
[]
[]
[]
[]
[]
[]
[]
[]
[]
[]
[]
[]
[]
[]
[]
[]
[null,null,null,null,null,null,null,null,null,null,null,null,null,null,null,null,null,null,null,null,null,null,null,null,"J69","J77","J85","J94","J105","J+105",null,"J56","J62","J69","J77","J85","J94","J105","J+105",null,"S56","S62","S69","S77","S85","S94","S105","S+105"]
[null,null,null,null,null,null,null,null,null,null,null,null,null,null,null,null,null,null,null,null,null,null,null,null,130,145,160,170,180,190,null,100,115,130,145,160,170,180,190,null,115,135,150,165,180,190,200,210]
[null,null,null,null,null,null,null,null,null,null,null,null,null,null,null,null,null,null,null,null,null,null,null,null,150,165,180,190,200,210,null,115,135,150,165,180,190,200,210,null,130,150,165,185,200,210,220,230]
[null,null,null,null,null,null,null,null,null,null,null,null,null,null,null,null,null,null,null,null,null,null,null,null,165,185,200,210,220,230,null,130,150,165,185,200,210,220,230,null,145,165,180,200,220,230,240,250]
[null,null,null,null,null,null,null,null,null,null,null,null,null,null,null,null,null,null,null,null,null,null,null,null,180,200,220,230,240,250,null,145,165,180,200,220,230,240,250,null,175,195,215,235,250,260,275,280]
[null,null,null,null,null,null,null,null,null,null,null,null,null,null,null,null,null,null,null,null,null,null,null,null,215,235,250,260,275,280,null,175,195,215,235,250,260,275,280,null,210,230,250,270,290,300,310,325]
[null,null,null,null,null,null,null,null,null,null,null,null,null,null,null,null,null,null,null,null,null,null,null,null,250,270,290,300,310,325,null,210,230,250,270,290,300,310,325,null,230,255,275,300,315,335,345,355]
[null,null,null,null,null,null,null,null,null,null,null,null,null,null,null,null,null,null,null,null,null,null,null,null,295,320,335,355,370,380,null,245,270,295,320,335,355,370,380,null,245,270,295,320,335,355,370,380]

{"sheet":"Feuil1","index":2,"n_rows":29,"n_cols":62,"rows_kept":29,"cut":false,"hidden":true,"merged":[]}
[null,null,"FC1 44","FC1 48","FC1 53","FC1 58","FC1 63","FC1 69","FC1 +69","FC2 44","FC2 48","FC2 53","FC2 58","FC2 63","FC2 69","FC2 +69","FJ48","FJ53","FJ58","FJ63","FJ69","FJ75","FJ+75","FS48","FS53","FS58","FS63","FS69","FS75","FS+75","C1 50","C1 56","C1 62","C1 69","C1 77","C1 85","C1 94","C1 +94","C2 50","C2 56","C2 62","C2 69","C2 77","C2 85","C2 94","C2 +94","J56","J62","J69","J77","J85","J94","J105","J+105","S56","S62","S69","S77","S85","S94","S105","S+105"]
[null,"DEBUTANT",25,25,35,40,45,50,60,30,35,45,40,55,60,70,45,55,60,65,70,80,90,55,65,70,75,80,95,100,40,50,75,85,90,100,110,120,45,65,85,95,110,120,125,135,80,90,110,130,145,150,155,165,95,120,130,150,165,170,175,185]
[null,"DEPARTEMENTAL",35,35,45,50,55,60,70,40,45,55,50,65,70,80,55,65,70,75,80,95,100,65,75,80,85,90,105,110,55,70,95,105,110,120,130,140,65,85,105,115,130,140,145,155,100,120,130,150,165,170,175,185,115,135,150,170,185,190,195,205]
[null,"REGIONAL",40,45,55,60,65,70,80,50,55,65,60,75,80,95,65,75,80,85,90,105,110,75,85,90,95,105,115,125,65,85,105,115,130,140,145,155,80,100,120,130,150,160,165,175,115,135,150,170,185,190,195,205,130,150,170,190,205,215,220,225]
[null,"INTERREGIONAL",50,55,65,70,75,80,95,60,65,75,70,85,90,105,75,85,90,95,105,115,125,85,95,100,110,120,130,140,80,100,120,130,150,160,165,175,95,115,135,150,170,180,185,195,130,150,170,190,205,215,220,225,145,170,190,210,225,235,245,250]
[null,"FEDERAL",60,65,75,80,85,90,105,70,75,85,80,95,105,115,85,95,100,110,120,130,140,95,105,115,125,135,145,150,95,115,135,150,170,180,185,195,110,130,150,170,185,200,210,220,145,170,190,210,225,235,245,250,170,190,220,240,250,260,270,280]
[null,"NATIONAL",70,75,85,90,95,105,115,80,85,95,90,110,120,130,95,105,115,125,135,145,150,110,120,130,140,150,160,170,110,130,150,170,185,200,210,220,120,145,170,190,200,220,225,235,170,190,220,240,250,260,270,280,190,210,240,265,280,290,300,310]
[null,"INTERNATIONAL B",80,85,95,100,110,120,130,90,95,105,100,125,135,145,110,120,130,140,150,160,170,125,140,150,160,170,180,190,120,145,170,190,200,220,225,235,135,170,190,210,220,240,250,260,190,210,240,260,280,290,300,310,210,230,260,285,300,310,325,330]
[null,"INTERNATIONAL A",90,95,105,115,125,135,145,100,110,120,115,140,150,160,125,135,150,160,170,180,190,140,160,170,180,190,195,210,135,170,190,210,220,240,250,260,150,190,210,230,250,260,280,280,210,230,250,285,300,310,325,330,225,255,275,305,325,330,345,355]
[null,"OLYMPIQUE",1000,1000,1000,1000,1000,1000,1000,1000,1000,1000,1000,1000,1000,1000,1000,1000,1000,1000,1000,1000,1000,155,175,190,200,205,210,225,1000,1000,1000,1000,1000,10000,1000,1000,1000,1000,1000,1000,1000,10000,1000,1000,1000,1000,1000,10000,1000,1000,1000,10000,240,270,290,320,345,355,365,375]
[null,"MINIME","CADET","CADET","JUNIOR","SENIOR",null,"MINIME","CADETTE","CADETTE","JUNIOR","SENIOR"]
[20.010000000000002,"M40","C1 50","C2 50","J56","S56",20.010000000000002,"FM36","FC1 44","FC2 44","FJ48","FS48"]
[34.01,"M40","C1 50","C2 50","J56","S56",30.01,"FM36","FC1 44","FC2 45","FJ48","FS48"]
[38.01,"M40","C1 50","C2 50","J56","S56",35.01,"FM36","FC1 44","FC2 46","FJ48","FS48"]
[40.01,"M45","C1 50","C2 50","J56","S56",36.01,"FM40","FC1 44","FC2 47","FJ48","FS48"]
[45.01,"M50","C1 50","C2 50","J56","S56",40.01,"FM44","FC1 44","FC2 48","FJ48","FS48"]
[50.01,"M56","C1 56","C2 56","J56","S56",44.01,"FM48","FC1 48","FC2 48","FJ48","FS48"]
[52.05,"M56","C1 56","C2 56","J56","S56",48.01,"FM53","FC1 53","FC2 53","FJ53","FS53"]
[56.01,"M62","C1 62","C2 62","J62","S62",53.01,"FM58","FC1 58","FC2 58","FJ58","FS58"]
[62.01,"M69","C1 69","C2 69","J69","S69",58.01,"FM+58","FC1 63","FC2 63","FJ63","FS63"]
[69.010000000000005,"M77","C1 77","C2 77","J77","S77",63.01,"FM+58","FC1 69","FC2 69","FJ69","FS69"]
[77.010000000000005,"M+77","C1 85","C2 85","J85","S85",69.010000000000005,"FM+58","FC1 +69","FC2 +69","FJ75","FS75"]
[85.01,"M+77","C1 94","C2 94","J94","S94",75.010000000000005,"FM+58","FC1 +69","FC2 +69","FJ+75","FS+75"]
[94.01,"M+77","C1 +94","C2 +94","J105","S105",110,"FM+58","FC1 +69","FC2 +69","FJ+75","FS+75"]
[105.01,"M+77","C1 +94","C2 +94","J+105","S+105",140,"FM+58","FC1 +69","FC2 +69","FJ+75","FS+75"]
[110,"M+77","C1 +94","C2 +94","J+105","S+105"]
[120,"M+77","C1 +94","C2 +94","J+105","S+105"]
[130,"M+77","C1 +94","C2 +94","J+105","S+105"]
[140,"M+77","C1 +94","C2 +94","J+105","S+105",null,null,null,null,null,null,null,null,null,null,null,null,null,null,null,null,null,null,null,null,null,null,null,null,null," "]